program: Orca
programVersion: 5.0.2
elementType: F F F F F F O O O O O N C C C C C C C C C C C C C C C C C C C C C C C C C C H H H H H H H H H H H H H H H H H H H H H
charge: 0
multiplicity: 1
keywords: wb97x-d3
keywords: def2-TZVPP
keywords: def2/J RIJCOSX
keywords: DEFGRID2
keywords: scfconv7
keywords: smallprint printgap noloewdin
keywords: NOSOSCF
formula: C26H21F6NO5
InChI: InChI=1/C26H21F6NO5/c1-24(2)18(11-12-20(34)38-23(25(27,28)29)26(30,31)32)21(24)22(35)37-19(14-33)15-7-6-10-17(13-15)36-16-8-4-3-5-9-16/h3-13,18-19,21,23H,1-2H3
59 atoms
F  3.976761 -0.474765 -1.035125
F  5.963186 0.237109 -0.611343
F  4.854984 -0.827859 0.895243
F  5.164254 1.412287 2.528121
F  6.156052 2.487167 0.947154
F  4.320748 3.243416 1.782893
O  -4.219473 0.228712 -1.184964
O  -3.730073 0.704291 0.936015
O  2.905384 1.067269 0.965971
O  1.806841 2.462696 -0.407292
O  -1.486539 -3.985348 -0.360302
N  -7.127368 0.360301 0.538437
C  -2.20709 3.148611 -0.2440
C  -1.163547 2.064855 -0.320746
C  -2.576899 1.822771 -0.861726
C  -2.05122 4.289087 -1.220568
C  -2.76758 3.590091 1.085685
C  -0.664446 1.383912 0.874384
C  -3.528288 0.890344 -0.235659
C  0.613901 1.182872 1.228233
C  -5.143494 -0.755851 -0.74748
C  1.779735 1.660905 0.488785
C  -4.480969 -1.89917 -0.00627
C  -6.235514 -0.126739 0.003254
C  -3.309518 -2.41221 -0.551211
C  4.140693 1.383754 0.37608
C  -5.0122 -2.441325 1.153541
C  -2.642666 -3.436893 0.10448
C  -4.356866 -3.497174 1.773058
C  4.75135 0.060822 -0.090344
C  4.96526 2.131436 1.424748
C  -3.167231 -3.989403 1.267146
C  -0.625079 -3.266544 -1.146598
C  -0.054763 -3.931899 -2.222247
C  -0.276042 -1.951774 -0.859462
C  0.871965 -3.274587 -3.019104
C  0.637872 -1.302366 -1.675616
C  1.216333 -1.95644 -2.755654
H  -0.444607 2.192754 -1.11795
H  -2.620855 1.813741 -1.944277
H  -1.647744 3.958947 -2.178307
H  -1.377246 5.046846 -0.817291
H  -3.014811 4.766124 -1.409703
H  -2.144889 4.391452 1.487201
H  -2.819834 2.809545 1.83933
H  -3.774205 3.991644 0.954802
H  -1.400862 0.974666 1.554694
H  0.815975 0.617606 2.128783
H  -5.586353 -1.135481 -1.672406
H  -2.914629 -2.005658 -1.4738
H  4.031501 2.036124 -0.497897
H  -5.923448 -2.051639 1.588513
H  -4.769028 -3.925319 2.677272
H  -2.644648 -4.796502 1.765033
H  -0.331896 -4.958282 -2.42918
H  -0.70735 -1.432147 -0.012244
H  1.318232 -3.797494 -3.855308
H  0.894164 -0.27222 -1.466712
H  1.92934 -1.442089 -3.386335
elementType: F O N C H
totalener: -2033.58881740 hartree
nucrepener: 4406.37770112 hartree
electener: -6439.96651852 hartree
twoeener: 5118.74570137 hartree
cpcmener: -0.03889761 hartree
kineticenergy: 2025.73494780 hartree
xcener: -182.490179810562 hartree
chargesum: -0.0000000
charge: -0.162099 -0.163057 -0.162855 -0.163091 -0.163228 -0.165515 -0.291731 -0.437762 -0.276148 -0.426157 -0.322442 -0.077742 0.114564 -0.006799 -0.062966 -0.255929 -0.278124 -0.159400 0.395978 -0.282931 0.524289 0.478441 -0.035497 -0.266055 -0.289430 0.048672 -0.207332 0.316068 -0.093820 0.478621 0.476134 -0.257492 0.318046 -0.267784 -0.243317 -0.094701 -0.093078 -0.227913 0.116770 0.103984 0.090397 0.097861 0.098606 0.101457 0.100348 0.106492 0.166623 0.141429 0.146975 0.144411 0.147447 0.132350 0.158408 0.146495 0.144538 0.170593 0.157537 0.157398 0.153458
qa: -0.1621 -0.1631 -0.1629 -0.1631 -0.1632 -0.1655 -0.2917 -0.4378 -0.2761 -0.4262 -0.3224 -0.0777 0.1146 -0.0068 -0.0630 -0.2559 -0.2781 -0.1594 0.3960 -0.2829 0.5243 0.4784 -0.0355 -0.2661 -0.2894 0.0487 -0.2073 0.3161 -0.0938 0.4786 0.4761 -0.2575 0.3180 -0.2678 -0.2433 -0.0947 -0.0931 -0.2279 0.1168 0.1040 0.0904 0.0979 0.0986 0.1015 0.1003 0.1065 0.1666 0.1414 0.1470 0.1444 0.1474 0.1323 0.1584 0.1465 0.1445 0.1706 0.1575 0.1574 0.1535
va: 1.1464 1.1526 1.1517 1.1515 1.1528 1.1466 2.1301 2.0531 2.1100 2.0728 2.1035 3.1069 3.8232 3.7296 3.9288 3.9041 3.9075 3.8167 4.0592 3.9235 3.7996 4.0998 3.7374 4.1034 3.9607 3.8723 3.9442 3.7194 3.9088 4.4975 4.5110 4.0193 3.7228 4.0302 3.9348 3.8609 3.8047 3.9857 1.0245 1.0284 1.0060 1.0027 1.0016 1.0008 1.0131 0.9995 0.9978 1.0117 0.9877 1.0144 1.0461 1.0180 0.9895 1.0069 1.0086 0.9873 0.9882 0.9938 0.9971
dispcorr: -0.035025345 hartree
energy: -2033.623842747455
dipole: -59.22666 59.43926 0.21260 0.55049 -0.66229 -0.11180 -12.18654 10.54062 -1.64592
magnitude: 1.66336 au
magnitude: 4.22792 debye
