program: Orca
programVersion: 5.0.2
elementType: F F F F F F O O O O O N C C C C C C C C C C C C C C C C C C C C C C C C C C H H H H H H H H H H H H H H H H H H H H H
charge: 0
multiplicity: 1
keywords: wb97x-d3
keywords: def2-TZVPP
keywords: def2/J RIJCOSX
keywords: DEFGRID2
keywords: scfconv7
keywords: smallprint printgap noloewdin
keywords: NOSOSCF
formula: C26H21F6NO5
InChI: InChI=1/C26H21F6NO5/c1-24(2)18(11-12-20(34)38-23(25(27,28)29)26(30,31)32)21(24)22(35)37-19(14-33)15-7-6-10-17(13-15)36-16-8-4-3-5-9-16/h3-13,18-19,21,23H,1-2H3
59 atoms
F  1.855743 -0.610602 -2.146708
F  3.961803 -0.472106 -2.592435
F  3.293412 -1.493338 -0.82167
F  4.332581 2.36312 0.471108
F  4.784283 0.279352 0.720173
F  5.427875 1.313808 -1.056441
O  -3.843098 1.158596 -1.186899
O  -3.226636 0.853793 0.933291
O  2.146372 0.853613 0.160092
O  0.784193 2.246861 -0.954623
O  -1.353439 -3.53225 0.821121
N  -6.104441 -0.811092 0.4769
C  -2.779382 3.934225 0.951799
C  -1.471681 3.290913 0.625403
C  -2.72354 2.918354 -0.173089
C  -2.956969 5.362704 0.49405
C  -3.503993 3.641546 2.241752
C  -0.834486 2.311404 1.522362
C  -3.269037 1.560345 -0.040636
C  0.280144 1.60465 1.294994
C  -4.264002 -0.198511 -1.275132
C  1.040607 1.637746 0.049097
C  -3.093567 -1.154731 -1.293509
C  -5.271113 -0.519969 -0.258111
C  -2.747795 -1.933339 -0.197062
C  3.106414 0.889116 -0.862274
C  -2.319122 -1.196158 -2.447499
C  -1.630044 -2.74899 -0.265196
C  -1.202886 -2.016871 -2.500698
C  3.063609 -0.445078 -1.608536
C  4.436357 1.202576 -0.174575
C  -0.849169 -2.798239 -1.41185
C  -0.117723 -3.472308 1.403234
C  0.677362 -2.333049 1.370833
C  0.300331 -4.608384 2.084999
C  1.904088 -2.345603 2.021745
C  1.523578 -4.601469 2.737246
C  2.33366 -3.473809 2.705661
H  -0.782132 3.889032 0.042039
H  -2.765795 3.323059 -1.177055
H  -2.424235 5.565577 -0.435847
H  -2.580799 6.054415 1.250047
H  -4.012094 5.588861 0.330932
H  -3.142414 4.314681 3.021239
H  -3.389717 2.625267 2.607631
H  -4.572624 3.825706 2.12046
H  -1.284403 2.171101 2.497983
H  0.656139 0.9599 2.078616
H  -4.781195 -0.251284 -2.236229
H  -3.33379 -1.921857 0.713205
H  2.908082 1.683801 -1.591488
H  -2.588255 -0.593915 -3.306446
H  -0.608958 -2.059032 -3.403812
H  0.018592 -3.44434 -1.460607
H  0.351272 -1.440744 0.851702
H  -0.331471 -5.487641 2.104442
H  2.525368 -1.460161 1.994405
H  1.846471 -5.488309 3.267344
H  3.291396 -3.474777 3.208958
elementType: F O N C H
totalener: -2033.58763693 hartree
nucrepener: 4567.63564109 hartree
electener: -6601.22327802 hartree
twoeener: 5281.18548176 hartree
cpcmener: -0.03945656 hartree
kineticenergy: 2025.76506100 hartree
xcener: -182.492123623996 hartree
chargesum: -0.0000000
charge: -0.164882 -0.164190 -0.162934 -0.166165 -0.162962 -0.163308 -0.287843 -0.447809 -0.281496 -0.430874 -0.329759 -0.081878 0.105113 -0.069326 -0.048735 -0.253159 -0.285473 -0.057870 0.406489 -0.310434 0.482590 0.512257 -0.054928 -0.253241 -0.141010 0.024865 -0.213383 0.198052 -0.141278 0.493957 0.484062 -0.167071 0.272809 -0.152392 -0.239237 -0.161710 -0.130344 -0.184084 0.110033 0.096928 0.090086 0.096684 0.098725 0.104212 0.095726 0.102687 0.157034 0.145712 0.145556 0.123544 0.157015 0.145442 0.159146 0.157202 0.139999 0.144370 0.144752 0.156635 0.156091
qa: -0.1649 -0.1642 -0.1629 -0.1662 -0.1630 -0.1633 -0.2878 -0.4478 -0.2815 -0.4309 -0.3298 -0.0819 0.1051 -0.0693 -0.0487 -0.2532 -0.2855 -0.0579 0.4065 -0.3104 0.4826 0.5123 -0.0549 -0.2532 -0.1410 0.0249 -0.2134 0.1981 -0.1413 0.4940 0.4841 -0.1671 0.2728 -0.1524 -0.2392 -0.1617 -0.1303 -0.1841 0.1100 0.0969 0.0901 0.0967 0.0987 0.1042 0.0957 0.1027 0.1570 0.1457 0.1456 0.1235 0.1570 0.1454 0.1591 0.1572 0.1400 0.1444 0.1448 0.1566 0.1561
va: 1.1434 1.1535 1.1403 1.1465 1.1444 1.1522 2.1454 2.0460 2.1077 2.0727 2.0771 3.1082 3.8025 3.7967 3.9098 3.8912 3.9001 3.8351 4.0738 3.9293 3.8242 4.0676 3.6684 4.0753 3.9893 3.8854 3.9841 3.8682 3.8708 4.4548 4.5083 3.9250 3.7634 3.8485 3.9843 3.8693 3.9093 3.9292 1.0255 1.0286 1.0049 1.0023 1.0020 0.9985 1.0183 1.0000 0.9872 1.0029 0.9904 1.0365 1.0447 1.0046 0.9928 0.9960 1.0021 1.0090 1.0099 0.9885 0.9910
dispcorr: -0.036252091 hartree
energy: -2033.623889019643
dipole: -45.65004 46.49750 0.84746 12.52810 -10.58652 1.94158 16.82310 -18.00960 -1.18650
magnitude: 2.42810 au
magnitude: 6.17175 debye
