program: Orca
programVersion: 5.0.2
elementType: F F F F F F O O O O O N C C C C C C C C C C C C C C C C C C C C C C C C C C H H H H H H H H H H H H H H H H H H H H H
charge: 0
multiplicity: 1
keywords: wb97x-d3
keywords: def2-TZVPP
keywords: def2/J RIJCOSX
keywords: DEFGRID2
keywords: scfconv7
keywords: smallprint printgap noloewdin
keywords: NOSOSCF
formula: C26H21F6NO5
InChI: InChI=1/C26H21F6NO5/c1-24(2)18(11-12-20(34)38-23(25(27,28)29)26(30,31)32)21(24)22(35)37-19(14-33)15-7-6-10-17(13-15)36-16-8-4-3-5-9-16/h3-13,18-19,21,23H,1-2H3
59 atoms
F  4.517939 -0.47367 -1.18717
F  6.226736 0.324999 -0.154722
F  4.841481 -0.958781 0.881589
F  3.75605 2.934076 1.935046
F  4.915229 1.2543 2.606804
F  5.772462 2.664142 1.227325
O  -3.811319 0.679513 0.296124
O  -4.408465 0.405425 -1.830685
O  2.826679 0.760123 0.716471
O  1.823793 2.083315 -0.796681
O  -1.6011 -3.793857 -0.396231
N  -4.907112 -0.107998 3.298548
C  -2.109621 3.032423 -0.609937
C  -1.16664 1.868748 -0.798658
C  -2.582341 1.827283 -1.383767
C  -1.833678 4.258018 -1.448254
C  -2.641149 3.378955 0.760042
C  -0.737583 1.046471 0.333188
C  -3.676724 0.91059 -1.014352
C  0.516651 0.763974 0.718759
C  -4.81068 -0.249058 0.691336
C  1.731654 1.286826 0.10186
C  -4.494982 -1.669613 0.277748
C  -4.857049 -0.150762 2.150549
C  -3.174676 -2.080246 0.191582
C  4.099698 1.236711 0.35948
C  -5.529234 -2.548236 -0.011947
C  -2.89192 -3.362599 -0.252321
C  -5.229557 -3.847499 -0.394601
C  4.938399 0.015878 -0.019987
C  4.650578 2.024472 1.55187
C  -3.912306 -4.258409 -0.535029
C  -0.663612 -2.934903 -0.92161
C  -0.959374 -2.053771 -1.956295
C  0.622659 -3.021992 -0.411451
C  0.052934 -1.260076 -2.476138
C  1.626554 -2.22944 -0.949649
C  1.347011 -1.343057 -1.9806
H  -0.425158 2.013501 -1.571738
H  -2.57811 1.962636 -2.458827
H  -1.449911 4.001175 -2.43556
H  -1.098143 4.896448 -0.956823
H  -2.746073 4.841356 -1.583081
H  -3.624463 3.843942 0.676531
H  -1.973372 4.107556 1.22186
H  -2.724092 2.54085 1.445133
H  -1.509819 0.619127 0.958813
H  0.654836 0.123453 1.579277
H  -5.793686 0.043919 0.308339
H  -2.365102 -1.407887 0.443571
H  4.068808 1.91128 -0.503206
H  -6.558712 -2.220166 0.053265
H  -6.0294 -4.540258 -0.617695
H  -3.678254 -5.261085 -0.868392
H  -1.960945 -1.980557 -2.360855
H  0.838081 -3.711249 0.394895
H  -0.176861 -0.573342 -3.280183
H  2.627482 -2.310848 -0.549479
H  2.126314 -0.721205 -2.398748
elementType: F O N C H
totalener: -2033.57281109 hartree
nucrepener: 4497.00904570 hartree
electener: -6530.58185679 hartree
twoeener: 5208.88637173 hartree
cpcmener: -0.04692950 hartree
kineticenergy: 2025.72545692 hartree
xcener: -182.490568944503 hartree
chargesum: 0.0000000
charge: -0.166600 -0.163838 -0.168475 -0.165476 -0.164310 -0.163809 -0.270046 -0.459808 -0.276287 -0.446818 -0.338119 -0.096912 0.124117 -0.005492 -0.094760 -0.264372 -0.264343 -0.149446 0.415859 -0.298191 0.364500 0.486251 0.032092 -0.217171 -0.191991 0.053207 -0.223271 0.246875 -0.107341 0.492986 0.478544 -0.235401 0.299610 -0.191606 -0.255141 -0.163560 -0.125338 -0.154809 0.119298 0.106703 0.092670 0.097711 0.098904 0.108875 0.100197 0.091403 0.177992 0.142395 0.153146 0.165488 0.146842 0.148632 0.162687 0.150658 0.152875 0.145743 0.159955 0.154162 0.152351
qa: -0.1666 -0.1638 -0.1685 -0.1655 -0.1643 -0.1638 -0.2700 -0.4598 -0.2763 -0.4468 -0.3381 -0.0969 0.1241 -0.0055 -0.0948 -0.2644 -0.2643 -0.1494 0.4159 -0.2982 0.3645 0.4863 0.0321 -0.2172 -0.1920 0.0532 -0.2233 0.2469 -0.1073 0.4930 0.4785 -0.2354 0.2996 -0.1916 -0.2551 -0.1636 -0.1253 -0.1548 0.1193 0.1067 0.0927 0.0977 0.0989 0.1089 0.1002 0.0914 0.1780 0.1424 0.1531 0.1655 0.1468 0.1486 0.1627 0.1507 0.1529 0.1457 0.1600 0.1542 0.1524
va: 1.1401 1.1532 1.1430 1.1468 1.1496 1.1498 2.1273 2.0343 2.1063 2.0438 2.0789 3.1046 3.8033 3.6797 3.9366 3.9095 3.9100 3.7860 4.1025 3.9050 3.7630 4.0715 3.5628 4.0705 3.9250 3.8677 3.9977 3.7758 3.8746 4.4685 4.5007 4.0072 3.6624 3.8438 4.0340 3.8900 3.8233 3.7983 1.0246 1.0235 1.0059 1.0025 1.0010 1.0005 1.0013 1.0066 0.9741 1.0127 1.0125 1.0000 1.0457 1.0006 0.9872 1.0037 1.0043 1.0093 0.9913 1.0056 1.0070
dispcorr: -0.039355856 hartree
energy: -2033.612166947953
dipole: -60.27917 59.36200 -0.91717 2.20396 -1.42029 0.78367 -16.81421 15.59530 -1.21891
magnitude: 1.71495 au
magnitude: 4.35907 debye
