program: Orca
programVersion: 5.0.2
elementType: F F F F F F O O O O O N C C C C C C C C C C C C C C C C C C C C C C C C C C H H H H H H H H H H H H H H H H H H H H H
charge: 0
multiplicity: 1
keywords: wb97x-d3
keywords: def2-TZVPP
keywords: def2/J RIJCOSX
keywords: DEFGRID2
keywords: scfconv7
keywords: smallprint printgap noloewdin
keywords: NOSOSCF
formula: C26H21F6NO5
InChI: InChI=1/C26H21F6NO5/c1-24(2)18(11-12-20(34)38-23(25(27,28)29)26(30,31)32)21(24)22(35)37-19(14-33)15-7-6-10-17(13-15)36-16-8-4-3-5-9-16/h3-13,18-19,21,23H,1-2H3
59 atoms
F  2.982479 -0.349614 -0.902195
F  3.803515 -0.094089 -2.879255
F  4.95991 0.451947 -1.146205
F  3.27242 4.050101 -2.460256
F  5.116685 3.099119 -1.919208
F  4.105671 2.524852 -3.732758
O  -0.9128 -0.162853 -0.259177
O  0.529513 -0.197463 1.45753
O  3.016034 2.263438 -0.366929
O  0.793966 2.561195 -0.520844
O  -4.392391 -3.656402 0.4782
N  0.467041 -0.478513 -3.242794
C  -1.520573 1.707879 2.846303
C  -0.59876 2.603502 2.09533
C  -1.234672 1.430088 1.375972
C  -2.916577 2.208183 3.126934
C  -0.986902 0.799965 3.925949
C  0.839881 2.695954 2.428225
C  -0.42792 0.293678 0.917185
C  1.889205 2.704584 1.60129
C  -0.294291 -1.273991 -0.869483
C  1.787958 2.519545 0.155164
C  -1.234076 -2.460368 -0.939373
C  0.127716 -0.830294 -2.201907
C  -2.412781 -2.456211 -0.21012
C  3.106026 1.841435 -1.704545
C  -0.86436 -3.575702 -1.681455
C  -3.211284 -3.594235 -0.207198
C  -1.686841 -4.691192 -1.687723
C  3.732921 0.447059 -1.66604
C  3.921171 2.887026 -2.464299
C  -2.858993 -4.713111 -0.947259
C  -4.580595 -2.880894 1.59921
C  -3.64838 -2.849773 2.629021
C  -5.767122 -2.170682 1.690348
C  -3.910218 -2.08023 3.753072
C  -6.02322 -1.417397 2.8285
C  -5.094347 -1.360643 3.8579
H  -1.013015 3.557297 1.776667
H  -2.034548 1.697676 0.69697
H  -3.282873 2.860464 2.333577
H  -2.938813 2.772638 4.060556
H  -3.613627 1.373444 3.224197
H  -1.068825 1.303983 4.890303
H  0.054821 0.518658 3.798026
H  -1.578368 -0.114448 3.983068
H  1.064371 2.807631 3.483937
H  2.884568 2.798457 2.015038
H  0.606609 -1.576392 -0.32727
H  -2.708565 -1.584797 0.357346
H  2.125628 1.761276 -2.189129
H  0.060085 -3.584687 -2.245617
H  -1.405126 -5.561813 -2.264438
H  -3.492831 -5.590278 -0.942348
H  -2.728064 -3.416072 2.561485
H  -6.485409 -2.209801 0.881439
H  -3.184089 -2.050444 4.554963
H  -6.951564 -0.866604 2.902522
H  -5.29309 -0.765696 4.739131
elementType: F O N C H
totalener: -2033.57240803 hartree
nucrepener: 4493.49489767 hartree
electener: -6527.06730570 hartree
twoeener: 5207.49439396 hartree
cpcmener: -0.04356811 hartree
kineticenergy: 2025.73732612 hartree
xcener: -182.490504722021 hartree
chargesum: 0.0000000
charge: -0.165745 -0.164861 -0.163794 -0.165652 -0.164272 -0.165039 -0.291071 -0.452822 -0.280513 -0.433174 -0.336413 -0.109657 0.110798 -0.024479 -0.052368 -0.256317 -0.283576 -0.118470 0.351162 -0.245589 0.444102 0.496033 0.029271 -0.214133 -0.214378 0.044776 -0.269726 0.298768 -0.104213 0.490592 0.482104 -0.258779 0.288452 -0.188480 -0.247849 -0.159646 -0.107767 -0.201526 0.120784 0.101530 0.092870 0.097240 0.088043 0.103745 0.098380 0.099019 0.159074 0.145206 0.139477 0.153353 0.146434 0.147939 0.161895 0.148329 0.158804 0.148631 0.168994 0.161631 0.162874
qa: -0.1657 -0.1649 -0.1638 -0.1657 -0.1643 -0.1650 -0.2911 -0.4528 -0.2805 -0.4332 -0.3364 -0.1097 0.1108 -0.0245 -0.0524 -0.2563 -0.2836 -0.1185 0.3512 -0.2456 0.4441 0.4960 0.0293 -0.2141 -0.2144 0.0448 -0.2697 0.2988 -0.1042 0.4906 0.4821 -0.2588 0.2885 -0.1885 -0.2478 -0.1596 -0.1078 -0.2015 0.1208 0.1015 0.0929 0.0972 0.0880 0.1037 0.0984 0.0990 0.1591 0.1452 0.1395 0.1534 0.1464 0.1479 0.1619 0.1483 0.1588 0.1486 0.1690 0.1616 0.1629
va: 1.1384 1.1484 1.1529 1.1473 1.1506 1.1508 2.0946 2.0349 2.1123 2.0689 2.0734 3.0870 3.7415 3.8760 3.8115 3.9060 3.8922 3.8704 4.0789 3.9097 3.6815 4.0691 3.7203 3.9993 3.9179 3.8724 4.0136 3.7316 3.8958 4.4779 4.5273 4.0205 3.6669 3.9032 4.0196 3.8291 3.8563 3.8635 1.0088 1.0306 1.0053 1.0025 1.0059 0.9997 1.0157 1.0071 0.9834 1.0092 1.0332 1.0139 1.0412 1.0058 0.9880 1.0065 0.9958 1.0066 0.9841 0.9873 0.9901
dispcorr: -0.036426226 hartree
energy: -2033.608834259585
dipole: -61.01324 59.32211 -1.69113 -14.82305 15.06611 0.24306 47.96478 -44.76939 3.19539
magnitude: 3.62346 au
magnitude: 9.21011 debye
