program: Orca
programVersion: 5.0.2
elementType: F F F F F F O O O O O N C C C C C C C C C C C C C C C C C C C C C C C C C C H H H H H H H H H H H H H H H H H H H H H
charge: 0
multiplicity: 1
keywords: wb97x-d3
keywords: def2-TZVPP
keywords: def2/J RIJCOSX
keywords: DEFGRID2
keywords: scfconv7
keywords: smallprint printgap noloewdin
keywords: NOSOSCF
formula: C26H21F6NO5
InChI: InChI=1/C26H21F6NO5/c1-24(2)18(11-12-20(34)38-23(25(27,28)29)26(30,31)32)21(24)22(35)37-19(14-33)15-7-6-10-17(13-15)36-16-8-4-3-5-9-16/h3-13,18-19,21,23H,1-2H3
59 atoms
F  1.076078 -0.053204 -1.918609
F  2.996342 -0.46427 -2.806561
F  2.47232 -1.335861 -0.910193
F  4.73577 -0.083597 0.13851
F  5.14142 0.928392 -1.719103
F  4.730438 2.062926 0.065537
O  -3.209435 1.019603 -1.049729
O  -2.379705 0.554018 0.972412
O  2.238518 1.117649 0.280041
O  0.846527 2.665548 -0.560933
O  -0.055726 -3.579793 -0.021372
N  -5.144261 -1.25067 0.636081
C  -2.805638 3.635058 1.372713
C  -1.35947 3.383119 1.136519
C  -2.377136 2.80929 0.162509
C  -3.317705 5.014749 1.039035
C  -3.528953 2.998135 2.531522
C  -0.548892 2.516486 2.015032
C  -2.623497 1.362637 0.111476
C  0.614727 1.935692 1.703843
C  -3.589364 -0.33812 -1.258703
C  1.199502 1.987778 0.369004
C  -2.428961 -1.253616 -1.573065
C  -4.428884 -0.836598 -0.164294
C  -1.805665 -2.014033 -0.591506
C  2.912997 1.00624 -0.947506
C  -1.992666 -1.317945 -2.891307
C  -0.717118 -2.804604 -0.931419
C  -0.928884 -2.143525 -3.222308
C  2.369884 -0.236282 -1.655411
C  4.401903 0.964241 -0.612683
C  -0.280302 -2.881775 -2.247073
C  -0.016891 -3.22982 1.307371
C  -0.188417 -4.254142 2.226718
C  0.243923 -1.930788 1.728986
C  -0.096112 -3.977669 3.583521
C  0.317628 -1.667757 3.089287
C  0.150428 -2.684006 4.02073
H  -0.803959 4.208421 0.703714
H  -2.451772 3.311817 -0.794023
H  -3.198831 5.678672 1.896972
H  -4.377531 4.986245 0.782191
H  -2.779821 5.455729 0.199356
H  -4.591118 2.897723 2.304294
H  -3.440021 3.640672 3.408924
H  -3.156482 2.015681 2.809188
H  -0.90824 2.363438 3.026653
H  1.135904 1.349765 2.448869
H  -4.239878 -0.291368 -2.134737
H  -2.165666 -1.995695 0.427973
H  2.74364 1.870593 -1.600075
H  -2.489586 -0.73665 -3.657485
H  -0.593575 -2.205823 -4.248757
H  0.558646 -3.516712 -2.50175
H  -0.386699 -5.260862 1.881654
H  0.385421 -1.128035 1.016746
H  -0.226056 -4.779038 4.29879
H  0.514675 -0.657237 3.422211
H  0.214273 -2.468031 5.078713
elementType: F O N C H
totalener: -2033.57311335 hartree
nucrepener: 4682.72653450 hartree
electener: -6716.29964784 hartree
twoeener: 5397.54529598 hartree
cpcmener: -0.04887590 hartree
kineticenergy: 2025.76074806 hartree
xcener: -182.494950662962 hartree
chargesum: 0.0000000
charge: -0.172242 -0.167974 -0.173523 -0.164235 -0.163995 -0.166052 -0.286551 -0.471028 -0.275833 -0.452004 -0.334392 -0.099658 0.120355 -0.028161 -0.129499 -0.259084 -0.290956 -0.071240 0.455896 -0.305839 0.488220 0.513543 -0.030625 -0.246709 -0.176782 0.051430 -0.244279 0.293577 -0.094081 0.513889 0.477551 -0.286466 0.296843 -0.246211 -0.187180 -0.126326 -0.144844 -0.189921 0.114911 0.100090 0.096822 0.098152 0.090661 0.103857 0.105892 0.092160 0.161496 0.154014 0.146454 0.137403 0.151352 0.147013 0.160240 0.146122 0.147178 0.136682 0.160761 0.162644 0.160478
qa: -0.1722 -0.1680 -0.1735 -0.1642 -0.1640 -0.1661 -0.2866 -0.4710 -0.2758 -0.4520 -0.3344 -0.0997 0.1204 -0.0282 -0.1295 -0.2591 -0.2910 -0.0712 0.4559 -0.3058 0.4882 0.5135 -0.0306 -0.2467 -0.1768 0.0514 -0.2443 0.2936 -0.0941 0.5139 0.4776 -0.2865 0.2968 -0.2462 -0.1872 -0.1263 -0.1448 -0.1899 0.1149 0.1001 0.0968 0.0982 0.0907 0.1039 0.1059 0.0922 0.1615 0.1540 0.1465 0.1374 0.1514 0.1470 0.1602 0.1461 0.1472 0.1367 0.1608 0.1626 0.1605
va: 1.1449 1.1518 1.1369 1.1492 1.1515 1.1458 2.1465 2.0099 2.1164 2.0512 2.0749 3.1027 3.7655 3.8037 3.9103 3.8979 3.9072 3.8132 4.0309 3.9077 3.8053 4.0573 3.6298 4.0684 3.8908 3.9126 4.0037 3.7308 3.8470 4.3891 4.5251 3.9790 3.7013 4.0038 3.8920 3.8800 3.8882 3.9359 1.0215 1.0289 1.0018 1.0020 1.0045 1.0004 0.9986 1.0159 0.9810 1.0036 0.9935 1.0237 1.0403 1.0017 0.9873 1.0081 1.0078 0.9949 0.9878 0.9896 0.9909
dispcorr: -0.038280352 hartree
energy: -2033.611393698302
dipole: -48.26690 48.26668 -0.00022 12.91597 -10.59556 2.32041 23.97824 -24.57865 -0.60041
magnitude: 2.39683 au
magnitude: 6.09225 debye
