program: Orca
programVersion: 5.0.2
elementType: O O O C C C C C C C C C C C C C C C C C C C H H H H H H H H H H H H H H H H H H H H H H H H H H
charge: 0
multiplicity: 1
keywords: wb97x-d3
keywords: def2-TZVPP
keywords: def2/J RIJCOSX
keywords: DEFGRID2
keywords: scfconv7
keywords: smallprint printgap noloewdin
keywords: NOSOSCF
formula: C19H26O3
InChI: InChI=1/C19H26O3/c1-7-8-13-12(4)16(10-15(13)20)22-18(21)17-14(9-11(2)3)19(17,5)6/h7,9,14,16-17H,1,8,10H2,2-6H3
48 atoms
O  0.06171 0.240158 -0.122826
O  -0.790291 -0.677951 1.738317
O  4.103626 2.320595 -0.810317
C  -2.899615 -1.819285 -0.28562
C  -3.469937 -0.64503 0.433996
C  -2.121048 -0.51277 -0.241932
C  -2.438599 -3.017211 0.508389
C  -3.459635 -2.184028 -1.640214
C  -4.644415 0.100464 -0.087961
C  -0.910604 -0.348619 0.586535
C  -4.779098 1.427356 -0.1073
C  1.308981 0.522249 0.511326
C  -6.016116 2.077024 -0.650125
C  -3.736747 2.376139 0.400755
C  1.865729 1.848222 0.009658
C  2.346816 -0.505792 0.130838
C  3.453526 0.062181 -0.365563
C  3.278709 1.525641 -0.441452
C  2.089876 -1.949762 0.366875
C  4.748819 -0.577494 -0.749828
C  5.654649 -0.665532 0.445345
C  6.735529 0.078861 0.628007
H  -3.404692 -0.711001 1.5178
H  -2.103607 0.038674 -1.175095
H  -3.268255 -3.716183 0.629306
H  -1.639089 -3.54795 -0.013181
H  -2.077798 -2.756397 1.499846
H  -3.773062 -1.310069 -2.210763
H  -2.714773 -2.718808 -2.231712
H  -4.326888 -2.838612 -1.533086
H  -5.467634 -0.503411 -0.460207
H  1.172328 0.522268 1.596025
H  -6.515286 2.673282 0.117563
H  -5.772411 2.762358 -1.465702
H  -6.732009 1.347524 -1.026594
H  -4.16354 3.043099 1.153547
H  -2.883902 1.874929 0.851499
H  -3.367235 3.015876 -0.40474
H  1.87017 2.632079 0.767396
H  1.290196 2.221123 -0.839733
H  1.822338 -2.129558 1.409488
H  2.951329 -2.567374 0.120621
H  1.247217 -2.298113 -0.234572
H  4.573725 -1.574362 -1.162445
H  5.224007 0.015217 -1.533105
H  5.358272 -1.375979 1.211662
H  7.340431 -0.013333 1.519808
H  7.049397 0.813294 -0.102769
totalener: -965.40500541 hartree
nucrepener: 1793.80768821 hartree
electener: -2759.21269362 hartree
oneelecener: -4873.64732640 hartree
twoeener: 2114.43463278 hartree
kineticenergy: 961.04887826 hartree
xcener: -95.139068282876 hartree
chargesum: -0.0000000
charge: -0.274224 -0.388506 -0.328270 0.123986 -0.013062 -0.118507 -0.265454 -0.267293 -0.244502 0.316698 -0.007345 0.208459 -0.209721 -0.226352 -0.135479 -0.061099 -0.029767 0.219542 -0.239216 -0.128619 -0.150014 -0.195636 0.108244 0.091404 0.087640 0.078254 0.104812 0.087320 0.090231 0.090498 0.094193 0.099523 0.088652 0.084380 0.078707 0.092826 0.084161 0.089549 0.086186 0.088650 0.116794 0.088773 0.098360 0.098239 0.092540 0.103778 0.100000 0.090664
qa: -0.2742 -0.3885 -0.3283 0.1240 -0.0131 -0.1185 -0.2655 -0.2673 -0.2445 0.3167 -0.0073 0.2085 -0.2097 -0.2264 -0.1355 -0.0611 -0.0298 0.2195 -0.2392 -0.1286 -0.1500 -0.1956 0.1082 0.0914 0.0876 0.0783 0.1048 0.0873 0.0902 0.0905 0.0942 0.0995 0.0887 0.0844 0.0787 0.0928 0.0842 0.0895 0.0862 0.0887 0.1168 0.0888 0.0984 0.0982 0.0925 0.1038 0.1000 0.0907
va: 2.1094 2.1071 2.1705 3.7344 3.8115 3.8499 3.9016 3.9059 3.8959 4.1942 3.7447 3.7939 3.9418 3.9399 3.8761 3.7395 3.4124 4.1340 3.9439 3.8844 3.8421 3.9866 1.0243 1.0301 1.0040 1.0037 1.0196 1.0055 1.0063 1.0017 1.0104 1.0291 0.9987 0.9995 1.0099 1.0021 1.0141 1.0009 1.0284 1.0318 1.0041 1.0068 1.0043 1.0025 1.0298 1.0081 1.0072 1.0196
dispcorr: -0.023111724 hartree
energy: -965.428117132991
dipole: -17.09561 15.97993 -1.11568 -6.34783 5.58100 -0.76683 -2.20962 1.99435 -0.21527
magnitude: 1.37081 au
magnitude: 3.48431 debye
