program: Orca
programVersion: 5.0.2
elementType: O O O C C C C C C C C C C C C C C C C C C C H H H H H H H H H H H H H H H H H H H H H H H H H H
charge: 0
multiplicity: 1
keywords: wb97x-d3
keywords: def2-TZVPP
keywords: def2/J RIJCOSX
keywords: DEFGRID2
keywords: scfconv7
keywords: smallprint printgap noloewdin
keywords: NOSOSCF
formula: C19H26O3
InChI: InChI=1/C19H26O3/c1-7-8-13-12(4)16(10-15(13)20)22-18(21)17-14(9-11(2)3)19(17,5)6/h7,9,14,16-17H,1,8,10H2,2-6H3
48 atoms
O  0.282465 0.544277 -0.314977
O  -0.674729 -0.323332 1.518054
O  4.419984 2.398954 -0.964519
C  -2.66402 -1.508716 -0.600297
C  -3.277503 -0.326616 0.084223
C  -1.896933 -0.200039 -0.53312
C  -2.247206 -2.689382 0.243482
C  -3.1496 -1.917839 -1.97087
C  -4.397344 0.445316 -0.482148
C  -0.730873 -0.018477 0.354981
C  -5.408595 1.001863 0.189042
C  1.498193 0.830898 0.379092
C  -6.470995 1.77681 -0.532328
C  -5.594371 0.933146 1.674496
C  2.136813 2.088338 -0.195948
C  2.51342 -0.263336 0.148585
C  3.653553 0.212531 -0.37015
C  3.545631 1.669229 -0.572556
C  2.208087 -1.669618 0.516367
C  4.909987 -0.538292 -0.683997
C  5.715697 -0.804639 0.552333
C  6.083458 -2.008131 0.970045
H  -3.250718 -0.390356 1.165999
H  -1.832779 0.340737 -1.47081
H  -1.411388 -3.221289 -0.216742
H  -1.95263 -2.410593 1.251866
H  -3.078465 -3.392343 0.320719
H  -3.368799 -1.071018 -2.6194
H  -2.395945 -2.525132 -2.474784
H  -4.059334 -2.51511 -1.890236
H  -4.384145 0.582976 -1.559187
H  1.291859 0.928392 1.448198
H  -7.459422 1.342856 -0.361869
H  -6.517824 2.807342 -0.171034
H  -6.300495 1.807786 -1.607796
H  -6.573425 0.514334 1.919261
H  -4.845083 0.33395 2.18601
H  -5.568865 1.934885 2.110883
H  2.156435 2.922614 0.50581
H  1.608386 2.429813 -1.087989
H  1.822983 -1.727205 1.535042
H  3.084964 -2.308691 0.443546
H  1.431907 -2.08143 -0.133178
H  4.680643 -1.478625 -1.190283
H  5.503877 0.060427 -1.379948
H  6.002503 0.070858 1.126325
H  6.665734 -2.142884 1.871046
H  5.821379 -2.906761 0.423894
totalener: -965.40697817 hartree
nucrepener: 1772.15840782 hartree
electener: -2737.56538599 hartree
oneelecener: -4830.26078380 hartree
twoeener: 2092.69539780 hartree
kineticenergy: 961.04464962 hartree
xcener: -95.139783125944 hartree
chargesum: -0.0000000
charge: -0.273689 -0.391127 -0.330493 0.084818 0.039105 -0.073848 -0.261721 -0.251225 -0.188125 0.318744 -0.053013 0.208753 -0.201675 -0.237396 -0.138312 -0.067806 -0.050395 0.230716 -0.227139 -0.114216 -0.145148 -0.220320 0.091401 0.072831 0.076835 0.102750 0.090417 0.073314 0.089667 0.095184 0.071435 0.100331 0.084441 0.084716 0.076026 0.084924 0.084568 0.087875 0.086146 0.090416 0.115983 0.088005 0.098863 0.091191 0.102000 0.120171 0.103316 0.080709
qa: -0.2737 -0.3911 -0.3305 0.0848 0.0391 -0.0738 -0.2617 -0.2512 -0.1881 0.3187 -0.0530 0.2088 -0.2017 -0.2374 -0.1383 -0.0678 -0.0504 0.2307 -0.2271 -0.1142 -0.1451 -0.2203 0.0914 0.0728 0.0768 0.1028 0.0904 0.0733 0.0897 0.0952 0.0714 0.1003 0.0844 0.0847 0.0760 0.0849 0.0846 0.0879 0.0861 0.0904 0.1160 0.0880 0.0989 0.0912 0.1020 0.1202 0.1033 0.0807
va: 2.1206 2.1050 2.1699 3.7321 3.7954 3.8563 3.9094 3.9156 3.9099 4.2482 3.8334 3.7844 3.9336 3.9442 3.8756 3.7517 3.4051 4.1212 3.9353 3.8890 3.8366 3.9567 1.0315 1.0370 1.0047 1.0199 1.0028 1.0110 1.0040 1.0028 1.0222 1.0266 0.9985 0.9983 1.0125 0.9993 1.0161 0.9987 1.0284 1.0321 1.0092 1.0149 1.0025 1.0027 1.0264 1.0108 1.0113 1.0145
dispcorr: -0.022096943 hartree
energy: -965.429075114417
dipole: -21.32363 20.08989 -1.23373 -10.81090 9.98147 -0.82943 0.62401 -0.69353 -0.06952
magnitude: 1.48825 au
magnitude: 3.78282 debye
