program: Orca
programVersion: 5.0.2
elementType: O O O C C C C C C C C C C C C C C C C C C C H H H H H H H H H H H H H H H H H H H H H H H H H H
charge: 0
multiplicity: 1
keywords: wb97x-d3
keywords: def2-TZVPP
keywords: def2/J RIJCOSX
keywords: DEFGRID2
keywords: scfconv7
keywords: smallprint printgap noloewdin
keywords: NOSOSCF
formula: C19H26O3
InChI: InChI=1/C19H26O3/c1-7-8-13-12(4)16(10-15(13)20)22-18(21)17-14(9-11(2)3)19(17,5)6/h7,9,14,16-17H,1,8,10H2,2-6H3
48 atoms
O  0.388498 -0.380731 0.517708
O  -0.949586 0.531788 2.05797
O  3.767327 2.698101 0.032091
C  -2.959587 -1.605144 0.860195
C  -3.312257 -0.225304 0.421441
C  -1.890088 -0.715458 0.244143
C  -2.938606 -1.917358 2.336673
C  -3.386606 -2.777107 0.00884
C  -4.169782 0.041748 -0.761865
C  -0.810058 -0.116825 1.054058
C  -4.061598 1.104384 -1.560206
C  1.534137 0.149254 1.185599
C  -4.993649 1.313029 -2.714706
C  -3.02127 2.166635 -1.379104
C  1.770472 1.632235 0.919076
C  2.735871 -0.550353 0.606353
C  3.64131 0.311786 0.127895
C  3.159684 1.696507 0.30784
C  2.813745 -2.033209 0.622456
C  4.945925 0.009685 -0.524491
C  4.839609 -0.447202 -1.952392
C  3.725411 -0.661845 -2.637776
H  -3.417489 0.485637 1.237725
H  -1.595505 -0.988754 -0.76276
H  -3.93145 -2.239853 2.656618
H  -2.243905 -2.730711 2.555791
H  -2.657425 -1.061415 2.945984
H  -3.37754 -2.545207 -1.055922
H  -2.722393 -3.62792 0.168443
H  -4.397537 -3.095706 0.270897
H  -4.964053 -0.671726 -0.960984
H  1.452594 -0.056736 2.257825
H  -4.444008 1.375805 -3.656823
H  -5.722928 0.509286 -2.803968
H  -5.541042 2.252709 -2.611387
H  -3.487686 3.150226 -1.28523
H  -2.399132 2.009878 -0.500491
H  -2.365812 2.218539 -2.252391
H  1.709253 2.2441 1.818514
H  1.045861 2.037838 0.210027
H  2.616178 -2.420604 1.62419
H  3.785178 -2.396815 0.294538
H  2.057724 -2.464437 -0.035753
H  5.57341 0.904953 -0.491179
H  5.490008 -0.751212 0.045121
H  5.793262 -0.604653 -2.446514
H  3.762896 -0.986119 -3.668478
H  2.741289 -0.5151 -2.210825
totalener: -965.40616641 hartree
nucrepener: 1812.22816301 hartree
electener: -2777.63432942 hartree
oneelecener: -4910.51540457 hartree
twoeener: 2132.88107515 hartree
kineticenergy: 961.04588078 hartree
xcener: -95.139178923662 hartree
chargesum: 0.0000000
charge: -0.280668 -0.382364 -0.324371 0.127655 -0.029948 -0.087900 -0.255708 -0.276716 -0.236945 0.301851 -0.002778 0.242168 -0.210050 -0.225905 -0.160682 -0.083191 -0.067163 0.256299 -0.245047 -0.081168 -0.156616 -0.202754 0.107127 0.082865 0.086641 0.084538 0.100989 0.085041 0.090835 0.092291 0.094271 0.092705 0.085171 0.078448 0.087459 0.091523 0.076078 0.089093 0.097539 0.084247 0.103407 0.093012 0.108184 0.097962 0.085365 0.102795 0.101361 0.083053
qa: -0.2807 -0.3824 -0.3244 0.1277 -0.0299 -0.0879 -0.2557 -0.2767 -0.2369 0.3019 -0.0028 0.2422 -0.2101 -0.2259 -0.1607 -0.0832 -0.0672 0.2563 -0.2450 -0.0812 -0.1566 -0.2028 0.1071 0.0829 0.0866 0.0845 0.1010 0.0850 0.0908 0.0923 0.0943 0.0927 0.0852 0.0784 0.0875 0.0915 0.0761 0.0891 0.0975 0.0842 0.1034 0.0930 0.1082 0.0980 0.0854 0.1028 0.1014 0.0831
va: 2.1124 2.1188 2.1810 3.7426 3.8358 3.8203 3.8966 3.9120 3.8971 4.2198 3.7304 3.7525 3.9418 3.9437 3.8929 3.6900 3.4503 4.0798 3.9591 3.8486 3.8863 3.9291 1.0261 1.0317 1.0031 1.0018 1.0199 1.0045 1.0064 1.0011 1.0094 1.0199 0.9988 1.0096 0.9990 1.0026 1.0193 1.0000 1.0277 1.0294 1.0021 1.0057 1.0035 1.0249 0.9991 1.0091 1.0114 1.0258
dispcorr: -0.023182976 hartree
energy: -965.429349390031
dipole: -16.56044 16.02114 -0.53930 -9.63384 8.10528 -1.52856 -7.99700 7.72186 -0.27514
magnitude: 1.64410 au
magnitude: 4.17897 debye
