program: Orca
programVersion: 5.0.2
elementType: O O O C C C C C C C C C C C C C C C C C C C H H H H H H H H H H H H H H H H H H H H H H H H H H
charge: 0
multiplicity: 1
keywords: wb97x-d3
keywords: def2-TZVPP
keywords: def2/J RIJCOSX
keywords: DEFGRID2
keywords: scfconv7
keywords: smallprint printgap noloewdin
keywords: NOSOSCF
formula: C19H26O3
InChI: InChI=1/C19H26O3/c1-7-8-13-12(4)16(10-15(13)20)22-18(21)17-14(9-11(2)3)19(17,5)6/h7,9,14,16-17H,1,8,10H2,2-6H3
48 atoms
O  0.277815 -0.535064 0.609144
O  -0.978009 0.497415 2.14288
O  3.745115 2.466441 0.013342
C  -3.189263 -1.470469 1.054178
C  -3.383427 -0.10785 0.483991
C  -2.018723 -0.76121 0.391414
C  -3.22943 -1.647797 2.552278
C  -3.726766 -2.661432 0.296581
C  -4.18368 0.135169 -0.744008
C  -0.894109 -0.195439 1.162399
C  -3.895851 1.039674 -1.680883
C  1.459042 -0.008746 1.211642
C  -4.779162 1.23788 -2.874873
C  -2.689045 1.92561 -1.626974
C  1.712975 1.461284 0.89282
C  2.627368 -0.748402 0.613155
C  3.551464 0.08589 0.121199
C  3.106832 1.484773 0.291599
C  2.656053 -2.233815 0.642068
C  4.840417 -0.229883 -0.564278
C  4.627942 -0.321861 -2.048651
C  5.053942 0.574855 -2.926096
H  -3.429177 0.682829 1.229651
H  -1.741986 -1.150526 -0.581605
H  -4.253076 -1.856802 2.868333
H  -2.611521 -2.491919 2.864149
H  -2.889877 -0.766581 3.090512
H  -3.658886 -2.534418 -0.783788
H  -3.173197 -3.56409 0.560132
H  -4.775906 -2.834511 0.544612
H  -5.088819 -0.454586 -0.858516
H  1.417957 -0.179034 2.29269
H  -5.626395 0.553414 -2.878227
H  -5.171326 2.257325 -2.90652
H  -4.222549 1.090776 -3.80378
H  -2.978343 2.974847 -1.719408
H  -2.122713 1.820245 -0.704694
H  -2.016135 1.715546 -2.462193
H  1.643616 2.112144 1.763437
H  1.00208 1.838617 0.15413
H  1.887099 -2.646251 -0.013392
H  2.444452 -2.608105 1.645824
H  3.617318 -2.634107 0.325267
H  5.56649 0.554107 -0.342062
H  5.253902 -1.168996 -0.18775
H  4.055154 -1.178004 -2.39279
H  4.85498 0.469542 -3.983876
H  5.607109 1.452699 -2.617386
totalener: -965.40559919 hartree
nucrepener: 1802.05178985 hartree
electener: -2767.45738904 hartree
oneelecener: -4890.22484538 hartree
twoeener: 2122.76745634 hartree
kineticenergy: 961.05049104 hartree
xcener: -95.137822692153 hartree
chargesum: 0.0000000
charge: -0.279098 -0.381736 -0.326208 0.126458 -0.026598 -0.089817 -0.257181 -0.272805 -0.238539 0.296321 -0.005689 0.227069 -0.210936 -0.221489 -0.150735 -0.059687 -0.025876 0.234712 -0.261190 -0.127131 -0.146505 -0.195750 0.107838 0.084942 0.085080 0.084058 0.102140 0.086131 0.090081 0.091230 0.093626 0.089433 0.078859 0.088462 0.084825 0.092499 0.074473 0.091395 0.099725 0.082451 0.110206 0.099709 0.089643 0.092475 0.097461 0.104367 0.099587 0.091711
qa: -0.2791 -0.3817 -0.3262 0.1265 -0.0266 -0.0898 -0.2572 -0.2728 -0.2385 0.2963 -0.0057 0.2271 -0.2109 -0.2215 -0.1507 -0.0597 -0.0259 0.2347 -0.2612 -0.1271 -0.1465 -0.1957 0.1078 0.0849 0.0851 0.0841 0.1021 0.0861 0.0901 0.0912 0.0936 0.0894 0.0789 0.0885 0.0848 0.0925 0.0745 0.0914 0.0997 0.0825 0.1102 0.0997 0.0896 0.0925 0.0975 0.1044 0.0996 0.0917
va: 2.1119 2.1201 2.1739 3.7332 3.8306 3.8194 3.9013 3.9115 3.8939 4.2208 3.7390 3.7863 3.9426 3.9432 3.8833 3.7112 3.4207 4.1057 3.9583 3.8800 3.8416 3.9797 1.0253 1.0320 1.0028 1.0019 1.0206 1.0047 1.0065 1.0016 1.0100 1.0185 1.0096 0.9987 0.9991 1.0028 1.0170 1.0002 1.0279 1.0303 1.0023 1.0023 1.0071 1.0295 1.0037 1.0091 1.0074 1.0192
dispcorr: -0.022752980 hartree
energy: -965.428352167117
dipole: -15.66598 14.97050 -0.69547 -8.05560 6.55158 -1.50402 -8.48529 8.15511 -0.33018
magnitude: 1.68961 au
magnitude: 4.29464 debye
