program: Orca
programVersion: 5.0.2
elementType: O O O C C C C C C C C C C C C C C C C C C C H H H H H H H H H H H H H H H H H H H H H H H H H H
charge: 0
multiplicity: 1
keywords: wb97x-d3
keywords: def2-TZVPP
keywords: def2/J RIJCOSX
keywords: DEFGRID2
keywords: scfconv7
keywords: smallprint printgap noloewdin
keywords: NOSOSCF
formula: C19H26O3
InChI: InChI=1/C19H26O3/c1-7-8-13-12(4)16(10-15(13)20)22-18(21)17-14(9-11(2)3)19(17,5)6/h7,9,14,16-17H,1,8,10H2,2-6H3
48 atoms
O  -0.021697 0.750147 0.345028
O  -0.954933 2.749961 0.699154
O  4.159335 1.539947 -1.262747
C  -2.398913 0.6375 -1.721311
C  -2.442456 -0.409997 -0.657269
C  -2.281863 1.040839 -0.261522
C  -1.192156 0.701152 -2.626619
C  -3.677702 1.049098 -2.410077
C  -3.683401 -1.152619 -0.316501
C  -1.04329 1.617891 0.306913
C  -3.957153 -1.665167 0.883958
C  1.239954 1.247066 0.792366
C  -5.21153 -2.444852 1.136452
C  -3.046836 -1.516795 2.06459
C  1.994388 2.034877 -0.274231
C  2.104379 0.048105 1.082544
C  3.247135 0.068494 0.385104
C  3.273929 1.249862 -0.499921
C  1.654292 -0.974713 2.060352
C  4.355071 -0.936529 0.400567
C  4.005743 -2.147633 -0.412604
C  3.940031 -3.383173 0.063716
H  -1.532162 -0.99744 -0.576823
H  -3.163206 1.531944 0.135537
H  -0.289248 0.316225 -2.15687
H  -1.369756 0.103198 -3.522212
H  -0.997439 1.725542 -2.950959
H  -3.59042 2.063312 -2.802845
H  -3.894779 0.386764 -3.250728
H  -4.537192 1.028711 -1.740309
H  -4.394282 -1.317649 -1.120892
H  1.090226 1.839434 1.700185
H  -4.982171 -3.459713 1.470443
H  -5.807405 -1.984269 1.928338
H  -5.834948 -2.518861 0.24637
H  -3.565402 -1.031098 2.894959
H  -2.727257 -2.495786 2.430803
H  -2.154295 -0.934674 1.843864
H  2.222581 3.054488 0.037309
H  1.434679 2.111369 -1.208165
H  2.433087 -1.699057 2.287275
H  0.794922 -1.523711 1.67068
H  1.332718 -0.506417 2.99288
H  5.253454 -0.467971 -0.0104
H  4.590324 -1.232523 1.425677
H  3.791143 -1.966203 -1.461016
H  3.682322 -4.22175 -0.568283
H  4.151459 -3.606732 1.102776
totalener: -965.40285464 hartree
nucrepener: 1835.39237139 hartree
electener: -2800.79522603 hartree
oneelecener: -4956.55003724 hartree
twoeener: 2155.75481121 hartree
kineticenergy: 961.04878553 hartree
xcener: -95.137507722483 hartree
chargesum: 0.0000000
charge: -0.279434 -0.351525 -0.327699 0.142951 -0.002377 -0.093764 -0.280524 -0.287130 -0.245819 0.307905 -0.009357 0.187786 -0.212085 -0.207594 -0.147520 -0.057956 -0.039426 0.243623 -0.244469 -0.118271 -0.138411 -0.220392 0.099796 0.087339 0.079129 0.090502 0.103704 0.096320 0.090850 0.083942 0.095609 0.095994 0.086008 0.086292 0.079253 0.089308 0.089995 0.053460 0.099667 0.085451 0.086035 0.104734 0.103619 0.104537 0.088758 0.118869 0.103590 0.078727
qa: -0.2794 -0.3515 -0.3277 0.1430 -0.0024 -0.0938 -0.2805 -0.2871 -0.2458 0.3079 -0.0094 0.1878 -0.2121 -0.2076 -0.1475 -0.0580 -0.0394 0.2436 -0.2445 -0.1183 -0.1384 -0.2204 0.0998 0.0873 0.0791 0.0905 0.1037 0.0963 0.0909 0.0839 0.0956 0.0960 0.0860 0.0863 0.0793 0.0893 0.0900 0.0535 0.0997 0.0855 0.0860 0.1047 0.1036 0.1045 0.0888 0.1189 0.1036 0.0787
va: 2.0697 2.1535 2.1730 3.7081 3.7929 3.8230 3.8937 3.9178 3.8943 4.2394 3.7464 3.7846 3.9432 3.9424 3.8783 3.7211 3.4150 4.0971 3.9573 3.8877 3.8324 3.9570 1.0193 1.0298 1.0177 1.0080 0.9979 1.0052 1.0001 1.0048 1.0090 1.0201 0.9983 0.9990 1.0099 1.0032 1.0011 1.0241 1.0267 1.0308 1.0145 1.0021 1.0026 1.0256 1.0035 1.0108 1.0111 1.0151
dispcorr: -0.024308464 hartree
energy: -965.427163103506
dipole: -16.51411 15.52143 -0.99267 -15.18875 13.91302 -1.27573 0.96604 -0.31014 0.65590
magnitude: 1.74444 au
magnitude: 4.43402 debye
