program: Orca
programVersion: 5.0.2
elementType: O O O C C C C C C C C C C C C C C C C C C C H H H H H H H H H H H H H H H H H H H H H H H H H H
charge: 0
multiplicity: 1
keywords: wb97x-d3
keywords: def2-TZVPP
keywords: def2/J RIJCOSX
keywords: DEFGRID2
keywords: scfconv7
keywords: smallprint printgap noloewdin
keywords: NOSOSCF
formula: C19H26O3
InChI: InChI=1/C19H26O3/c1-7-8-13-12(4)16(10-15(13)20)22-18(21)17-14(9-11(2)3)19(17,5)6/h7,9,14,16-17H,1,8,10H2,2-6H3
48 atoms
O  0.082972 1.46155 -0.655992
O  0.239668 -0.767864 -0.52255
O  4.662324 0.272158 -1.290664
C  -2.564901 -0.535707 -1.970229
C  -2.712666 -0.966469 -0.551143
C  -1.888588 0.263731 -0.86498
C  -1.744502 -1.383638 -2.910933
C  -3.722413 0.158764 -2.646925
C  -3.997029 -0.842363 0.184907
C  -0.426005 0.225756 -0.666534
C  -4.114397 -0.550565 1.480977
C  1.483486 1.646215 -0.465527
C  -5.454698 -0.470038 2.146402
C  -2.940256 -0.28231 2.37202
C  2.400816 1.118514 -1.565073
C  2.038103 1.066756 0.812367
C  3.25611 0.542409 0.625893
C  3.605965 0.587355 -0.806147
C  1.295543 1.188051 2.092743
C  4.183999 -0.020953 1.646554
C  3.871736 -1.424931 2.079855
C  2.845344 -2.164327 1.683365
H  -2.108198 -1.830228 -0.283474
H  -2.34711 1.222588 -0.651177
H  -1.313665 -0.776745 -3.709744
H  -0.933761 -1.908347 -2.410906
H  -2.383688 -2.134316 -3.379136
H  -4.409578 -0.571806 -3.079044
H  -4.292421 0.784697 -1.960463
H  -3.366511 0.795382 -3.458553
H  -4.902452 -1.038475 -0.382372
H  1.5658 2.735554 -0.405186
H  -5.612443 0.51505 2.592794
H  -6.270326 -0.657326 1.449268
H  -5.53412 -1.195609 2.959531
H  -2.961736 -0.93897 3.244945
H  -1.98482 -0.428653 1.872495
H  -2.968663 0.741339 2.754747
H  2.692708 1.876582 -2.291652
H  1.948581 0.29215 -2.115005
H  0.849552 2.177718 2.206626
H  1.937027 0.993041 2.95019
H  0.480259 0.461986 2.134108
H  5.201569 0.002267 1.245329
H  4.205094 0.622279 2.533453
H  4.580402 -1.84545 2.786976
H  2.716617 -3.170918 2.057852
H  2.108345 -1.810671 0.974259
totalener: -965.40265501 hartree
nucrepener: 1857.61214636 hartree
electener: -2823.01480136 hartree
oneelecener: -5001.44207155 hartree
twoeener: 2178.42727018 hartree
kineticenergy: 961.04066525 hartree
xcener: -95.142392857139 hartree
chargesum: 0.0000000
charge: -0.269166 -0.405418 -0.328411 0.128628 -0.019096 -0.117105 -0.263949 -0.275691 -0.243269 0.327174 -0.005829 0.275332 -0.212437 -0.210296 -0.157450 -0.055143 -0.092557 0.237242 -0.254535 -0.103381 -0.158345 -0.216278 0.108674 0.084052 0.087385 0.100510 0.087759 0.092116 0.085216 0.092560 0.094731 0.099427 0.084773 0.079799 0.088066 0.093318 0.060707 0.090251 0.087621 0.101469 0.106674 0.099850 0.108499 0.095819 0.082702 0.100790 0.094565 0.112649
qa: -0.2692 -0.4054 -0.3284 0.1286 -0.0191 -0.1171 -0.2639 -0.2757 -0.2433 0.3272 -0.0058 0.2753 -0.2124 -0.2103 -0.1574 -0.0551 -0.0926 0.2372 -0.2545 -0.1034 -0.1583 -0.2163 0.1087 0.0841 0.0874 0.1005 0.0878 0.0921 0.0852 0.0926 0.0947 0.0994 0.0848 0.0798 0.0881 0.0933 0.0607 0.0903 0.0876 0.1015 0.1067 0.0999 0.1085 0.0958 0.0827 0.1008 0.0946 0.1126
va: 2.1366 2.0707 2.1761 3.7373 3.8105 3.8215 3.9019 3.9087 3.9019 4.1890 3.7405 3.7749 3.9425 3.9360 3.8571 3.6663 3.4554 4.1072 3.9465 3.8609 3.8751 3.9194 1.0256 1.0346 1.0014 1.0203 1.0035 1.0010 1.0048 1.0061 1.0098 0.9922 0.9988 1.0094 0.9987 1.0037 1.0219 0.9996 1.0290 1.0307 1.0026 1.0049 0.9993 1.0233 0.9992 1.0075 1.0130 1.0244
dispcorr: -0.025154647 hartree
energy: -965.427809653977
dipole: -21.71488 20.01534 -1.69954 -3.80295 4.66592 0.86297 7.09877 -6.36993 0.72884
magnitude: 2.04068 au
magnitude: 5.18699 debye
