program: Orca
programVersion: 5.0.2
elementType: O O O C C C C C C C C C C C C C C C C C C C H H H H H H H H H H H H H H H H H H H H H H H H H H
charge: 0
multiplicity: 1
keywords: wb97x-d3
keywords: def2-TZVPP
keywords: def2/J RIJCOSX
keywords: DEFGRID2
keywords: scfconv7
keywords: smallprint printgap noloewdin
keywords: NOSOSCF
formula: C19H26O3
InChI: InChI=1/C19H26O3/c1-7-8-13-12(4)16(10-15(13)20)22-18(21)17-14(9-11(2)3)19(17,5)6/h7,9,14,16-17H,1,8,10H2,2-6H3
48 atoms
O  0.156168 -0.337864 0.705931
O  -0.143583 -2.489302 1.259788
O  3.790661 2.398835 0.74017
C  -2.847757 -0.083016 1.351155
C  -2.582139 -0.052126 -0.124205
C  -2.037948 -1.192262 0.699414
C  -2.195151 0.947749 2.24038
C  -4.223863 -0.480684 1.826994
C  -3.640828 -0.320234 -1.132096
C  -0.593876 -1.425896 0.926054
C  -4.51298 0.587748 -1.571332
C  1.567474 -0.404898 0.918458
C  -5.531209 0.253921 -2.618486
C  -4.54135 2.000741 -1.073995
C  2.068304 0.889349 1.547929
C  2.281751 -0.494717 -0.4080
C  3.158459 0.503946 -0.578184
C  3.119078 1.412425 0.583658
C  1.992894 -1.611743 -1.343075
C  4.072624 0.738593 -1.732126
C  5.303183 -0.123254 -1.756728
C  5.626116 -1.074483 -0.892284
H  -1.83671 0.677374 -0.427921
H  -2.569432 -2.134458 0.617432
H  -2.872971 1.792903 2.376382
H  -1.984886 0.538326 3.230272
H  -1.26655 1.338473 1.832595
H  -4.673058 -1.25397 1.20585
H  -4.182842 -0.853075 2.852028
H  -4.896318 0.379496 1.81086
H  -3.683901 -1.323723 -1.545646
H  1.79924 -1.279425 1.531349
H  -6.544486 0.444978 -2.256921
H  -5.396517 0.874018 -3.508257
H  -5.475381 -0.789269 -2.926699
H  -4.325749 2.701774 -1.884484
H  -5.534565 2.259164 -0.698888
H  -3.825159 2.183952 -0.275265
H  2.500872 0.743215 2.538346
H  1.268622 1.62431 1.653956
H  0.985455 -1.519247 -1.755391
H  2.029237 -2.570826 -0.82402
H  2.697763 -1.643178 -2.171211
H  3.532416 0.602083 -2.674739
H  4.386216 1.786446 -1.724864
H  5.980179 0.084758 -2.579523
H  6.544591 -1.634555 -1.000189
H  5.000558 -1.328162 -0.046306
totalener: -965.40216781 hartree
nucrepener: 1813.58023885 hartree
electener: -2778.98240666 hartree
oneelecener: -4913.01316300 hartree
twoeener: 2134.03075634 hartree
kineticenergy: 961.04522560 hartree
xcener: -95.139983317780 hartree
chargesum: -0.0000000
charge: -0.282345 -0.362912 -0.324702 0.086361 0.002243 -0.111064 -0.274386 -0.248321 -0.219454 0.331109 -0.020373 0.212980 -0.210627 -0.241057 -0.151157 -0.081226 -0.075457 0.242946 -0.231713 -0.092812 -0.159276 -0.202568 0.102478 0.085449 0.086928 0.101881 0.082002 0.084091 0.098143 0.085577 0.093253 0.102700 0.084737 0.086860 0.080267 0.098354 0.087606 0.080513 0.089637 0.088752 0.107793 0.115168 0.095602 0.089351 0.097043 0.102138 0.102426 0.085064
qa: -0.2823 -0.3629 -0.3247 0.0864 0.0022 -0.1111 -0.2744 -0.2483 -0.2195 0.3311 -0.0204 0.2130 -0.2106 -0.2411 -0.1512 -0.0812 -0.0755 0.2429 -0.2317 -0.0928 -0.1593 -0.2026 0.1025 0.0854 0.0869 0.1019 0.0820 0.0841 0.0981 0.0856 0.0933 0.1027 0.0847 0.0869 0.0803 0.0984 0.0876 0.0805 0.0896 0.0888 0.1078 0.1152 0.0956 0.0894 0.0970 0.1021 0.1024 0.0851
va: 2.0735 2.1445 2.1809 3.7077 3.7732 3.8919 3.9098 3.9174 3.8589 4.2739 3.7401 3.7355 3.9406 3.9413 3.8748 3.7171 3.4138 4.1100 3.9354 3.8566 3.8811 3.9371 1.0232 1.0311 1.0042 1.0016 1.0165 1.0072 1.0048 1.0020 1.0140 1.0353 0.9994 0.9979 1.0104 1.0023 1.0001 1.0094 1.0257 1.0313 1.0012 1.0072 1.0062 0.9978 1.0242 1.0094 1.0109 1.0197
dispcorr: -0.024183747 hartree
energy: -965.426351558047
dipole: -20.58908 19.36243 -1.22665 1.93597 -2.05240 -0.11643 -6.11235 5.45152 -0.66083
magnitude: 1.39818 au
magnitude: 3.55390 debye
