program: Orca
programVersion: 5.0.2
elementType: O O O C C C C C C C C C C C C C C C C C C C H H H H H H H H H H H H H H H H H H H H H H H H H H
charge: 0
multiplicity: 1
keywords: wb97x-d3
keywords: def2-TZVPP
keywords: def2/J RIJCOSX
keywords: DEFGRID2
keywords: scfconv7
keywords: smallprint printgap noloewdin
keywords: NOSOSCF
formula: C19H26O3
InChI: InChI=1/C19H26O3/c1-7-8-13-12(4)16(10-15(13)20)22-18(21)17-14(9-11(2)3)19(17,5)6/h7,9,14,16-17H,1,8,10H2,2-6H3
48 atoms
O  -0.008095 -0.088766 0.750876
O  -0.36209 -2.291184 0.970363
O  3.907063 2.317125 0.748822
C  -2.960345 -0.000275 1.810131
C  -2.791496 0.497327 0.412384
C  -2.233935 -0.858381 0.787764
C  -2.20083 0.679481 2.923808
C  -4.308974 -0.520719 2.247279
C  -3.93292 0.60513 -0.532929
C  -0.789338 -1.173247 0.85387
C  -3.861681 0.403171 -1.849256
C  1.407838 -0.242324 0.860138
C  -5.060818 0.571789 -2.731953
C  -2.599619 0.00893 -2.555075
C  2.014806 0.995992 1.506904
C  2.05666 -0.326723 -0.501482
C  3.028729 0.583985 -0.648974
C  3.116031 1.430656 0.555984
C  1.645654 -1.363944 -1.482612
C  3.948191 0.767866 -1.807347
C  5.09199 -0.204913 -1.863871
C  5.315305 -1.218287 -1.039327
H  -2.040465 1.275205 0.304546
H  -2.802769 -1.717422 0.450079
H  -1.256747 1.107541 2.594181
H  -2.800841 1.49316 3.335148
H  -1.990451 -0.017374 3.737174
H  -4.837865 -1.034347 1.444661
H  -4.197841 -1.225078 3.073142
H  -4.945082 0.296391 2.594166
H  -4.887289 0.907095 -0.110632
H  1.628456 -1.150099 1.428476
H  -4.886716 1.34172 -3.487749
H  -5.282159 -0.351085 -3.273964
H  -5.949846 0.851121 -2.16791
H  -2.325409 0.7621 -3.298329
H  -1.754897 -0.111994 -1.879815
H  -2.735153 -0.928764 -3.100007
H  2.412327 0.814777 2.505778
H  1.278475 1.797827 1.592512
H  2.299618 -1.381231 -2.351987
H  0.623931 -1.191367 -1.829733
H  1.653391 -2.354615 -1.026124
H  3.390734 0.707246 -2.747773
H  4.358585 1.781091 -1.775337
H  5.791954 -0.02926 -2.674747
H  6.174388 -1.861524 -1.169414
H  4.661652 -1.446059 -0.207255
totalener: -965.40199381 hartree
nucrepener: 1832.87426441 hartree
electener: -2798.27625822 hartree
oneelecener: -4951.55997070 hartree
twoeener: 2153.28371248 hartree
kineticenergy: 961.03328600 hartree
xcener: -95.138201383829 hartree
chargesum: 0.0000000
charge: -0.277344 -0.360715 -0.324066 0.127176 0.017581 -0.124533 -0.255635 -0.283079 -0.257633 0.324780 -0.010980 0.216322 -0.213301 -0.193770 -0.140628 -0.100159 -0.065383 0.232867 -0.224675 -0.089518 -0.157060 -0.202107 0.098941 0.091322 0.077623 0.088549 0.096783 0.085936 0.095386 0.090629 0.094566 0.097139 0.087094 0.086137 0.079538 0.092886 0.045681 0.089804 0.090281 0.085823 0.095808 0.101261 0.118207 0.087329 0.096729 0.101904 0.102497 0.084006
qa: -0.2773 -0.3607 -0.3241 0.1272 0.0176 -0.1245 -0.2556 -0.2831 -0.2576 0.3248 -0.0110 0.2163 -0.2133 -0.1938 -0.1406 -0.1002 -0.0654 0.2329 -0.2247 -0.0895 -0.1571 -0.2021 0.0989 0.0913 0.0776 0.0885 0.0968 0.0859 0.0954 0.0906 0.0946 0.0971 0.0871 0.0861 0.0795 0.0929 0.0457 0.0898 0.0903 0.0858 0.0958 0.1013 0.1182 0.0873 0.0967 0.1019 0.1025 0.0840
va: 2.0732 2.1411 2.1810 3.7296 3.7721 3.8492 3.9085 3.9182 3.9078 4.2171 3.7586 3.7624 3.9420 3.9347 3.8688 3.7277 3.4161 4.1280 3.9434 3.8618 3.8809 3.9385 1.0252 1.0291 1.0144 1.0046 1.0017 1.0050 1.0055 1.0004 1.0092 1.0325 0.9982 0.9992 1.0098 1.0024 1.0251 1.0018 1.0261 1.0303 1.0058 0.9998 1.0090 0.9981 1.0235 1.0094 1.0109 1.0200
dispcorr: -0.024586176 hartree
energy: -965.426579984109
dipole: -17.27803 16.09154 -1.18650 -1.96291 1.77141 -0.19150 -7.08100 6.47576 -0.60525
magnitude: 1.34565 au
magnitude: 3.42036 debye
