program: Orca
programVersion: 5.0.2
elementType: O O O C C C C C C C C C C C C C C C C C C C H H H H H H H H H H H H H H H H H H H H H H H H H H
charge: 0
multiplicity: 1
keywords: wb97x-d3
keywords: def2-TZVPP
keywords: def2/J RIJCOSX
keywords: DEFGRID2
keywords: scfconv7
keywords: smallprint printgap noloewdin
keywords: NOSOSCF
formula: C19H26O3
InChI: InChI=1/C19H26O3/c1-7-8-13-12(4)16(10-15(13)20)22-18(21)17-14(9-11(2)3)19(17,5)6/h7,9,14,16-17H,1,8,10H2,2-6H3
48 atoms
O  0.189703 0.559618 -0.017926
O  -0.85333 -0.050689 1.872499
O  4.267405 2.57447 -0.664323
C  -2.47251 -1.815652 -0.188679
C  -3.290696 -0.666367 0.290663
C  -1.897797 -0.408088 -0.24865
C  -1.955675 -2.81083 0.821614
C  -2.786906 -2.439884 -1.52745
C  -4.479144 -0.163164 -0.442785
C  -0.831676 0.03477 0.671458
C  -4.966028 1.074403 -0.339566
C  1.332039 1.041422 0.691353
C  -6.189322 1.498954 -1.09336
C  -4.345794 2.130426 0.523675
C  1.942012 2.224511 -0.049385
C  2.422968 -0.002795 0.720425
C  3.583243 0.473032 0.248645
C  3.405692 1.859667 -0.220298
C  2.157258 -1.363117 1.252916
C  4.895293 -0.235983 0.131576
C  4.947295 -1.085744 -1.103461
C  5.1479 -2.396229 -1.11154
H  -3.347807 -0.586058 1.373196
H  -1.837025 0.016637 -1.244052
H  -2.685493 -3.611848 0.952362
H  -1.025217 -3.269391 0.47978
H  -1.774384 -2.36714 1.797598
H  -3.581565 -3.182562 -1.430013
H  -3.106621 -1.706791 -2.267675
H  -1.908215 -2.948171 -1.927558
H  -4.996452 -0.868015 -1.08696
H  1.042082 1.303529 1.712396
H  -6.589191 0.696257 -1.711717
H  -6.979279 1.822474 -0.41103
H  -5.972513 2.349839 -1.744003
H  -5.061876 2.491183 1.26625
H  -3.461544 1.784699 1.055069
H  -4.058206 2.998719 -0.074532
H  1.837342 3.171694 0.480176
H  1.484496 2.351527 -1.032515
H  1.65936 -1.315878 2.221993
H  3.069537 -1.947374 1.351659
H  1.491702 -1.912744 0.583121
H  5.690448 0.513479 0.089832
H  5.082359 -0.850762 1.014861
H  4.803394 -0.561503 -2.0430
H  5.175266 -2.959098 -2.034425
H  5.298438 -2.957931 -0.1972
totalener: -965.40610763 hartree
nucrepener: 1798.52671392 hartree
electener: -2763.93282156 hartree
oneelecener: -4883.01018652 hartree
twoeener: 2119.07736496 hartree
kineticenergy: 961.04014039 hartree
xcener: -95.137739608438 hartree
chargesum: 0.0000000
charge: -0.270402 -0.389737 -0.329797 0.141733 -0.045115 -0.074436 -0.268369 -0.279356 -0.227501 0.304616 -0.002159 0.215469 -0.210621 -0.230571 -0.137126 -0.066790 -0.039671 0.220465 -0.237992 -0.117938 -0.141239 -0.218881 0.105832 0.081316 0.090759 0.079455 0.103790 0.094208 0.082524 0.091598 0.094827 0.098183 0.078697 0.086705 0.084990 0.090054 0.079214 0.085731 0.086839 0.089129 0.121913 0.086571 0.099594 0.103942 0.088711 0.119653 0.102820 0.078359
qa: -0.2704 -0.3897 -0.3298 0.1417 -0.0451 -0.0744 -0.2684 -0.2794 -0.2275 0.3046 -0.0022 0.2155 -0.2106 -0.2306 -0.1371 -0.0668 -0.0397 0.2205 -0.2380 -0.1179 -0.1412 -0.2189 0.1058 0.0813 0.0908 0.0795 0.1038 0.0942 0.0825 0.0916 0.0948 0.0982 0.0787 0.0867 0.0850 0.0901 0.0792 0.0857 0.0868 0.0891 0.1219 0.0866 0.0996 0.1039 0.0887 0.1197 0.1028 0.0784
va: 2.1218 2.1020 2.1702 3.7372 3.8530 3.8155 3.8920 3.9110 3.8940 4.2272 3.7324 3.7812 3.9415 3.9461 3.8665 3.7538 3.3994 4.1307 3.9355 3.8932 3.8358 3.9583 1.0236 1.0346 1.0050 1.0040 1.0172 0.9999 1.0050 1.0062 1.0092 1.0265 1.0098 0.9986 0.9990 1.0015 1.0199 1.0006 1.0282 1.0328 1.0088 1.0129 1.0029 1.0252 1.0031 1.0101 1.0107 1.0152
dispcorr: -0.023098992 hartree
energy: -965.429206624395
dipole: -18.24456 17.15694 -1.08762 -10.87088 10.05303 -0.81784 -2.99840 2.94033 -0.05807
magnitude: 1.36204 au
magnitude: 3.46203 debye
