program: Orca
programVersion: 5.0.2
elementType: O O O C C C C C C C C C C C C C C C C C C C H H H H H H H H H H H H H H H H H H H H H H H H H H
charge: 0
multiplicity: 1
keywords: wb97x-d3
keywords: def2-TZVPP
keywords: def2/J RIJCOSX
keywords: DEFGRID2
keywords: scfconv7
keywords: smallprint printgap noloewdin
keywords: NOSOSCF
formula: C19H26O3
InChI: InChI=1/C19H26O3/c1-7-8-13-12(4)16(10-15(13)20)22-18(21)17-14(9-11(2)3)19(17,5)6/h7,9,14,16-17H,1,8,10H2,2-6H3
48 atoms
O  0.183504 0.567755 -0.000512
O  -0.859914 -0.058735 1.884265
O  4.25286 2.590111 -0.645246
C  -2.458968 -1.815687 -0.202044
C  -3.29038 -0.685093 0.299364
C  -1.903553 -0.399455 -0.23993
C  -1.920664 -2.818853 0.78917
C  -2.770883 -2.422376 -1.549332
C  -4.486727 -0.186455 -0.425136
C  -0.838555 0.038098 0.684178
C  -4.967298 1.054518 -0.333992
C  1.325264 1.044069 0.713785
C  -6.196852 1.47369 -1.080763
C  -4.334387 2.12015 0.508182
C  1.932444 2.235845 -0.015033
C  2.417417 0.000995 0.729829
C  3.574448 0.480418 0.253762
C  3.394356 1.871468 -0.20122
C  2.156699 -1.363199 1.254778
C  4.883597 -0.231282 0.119509
C  4.905898 -1.10229 -1.101536
C  5.106754 -2.412716 -1.092245
H  -3.346844 -0.622771 1.383202
H  -1.851418 0.043013 -1.228094
H  -1.748021 -2.390039 1.773297
H  -2.632192 -3.638264 0.905264
H  -0.980783 -3.250622 0.4381
H  -3.549283 -3.183001 -1.459287
H  -3.111774 -1.682839 -2.273512
H  -1.885192 -2.905303 -1.965137
H  -5.015127 -0.898288 -1.052598
H  1.034877 1.294568 1.737547
H  -5.985041 2.319326 -1.739857
H  -6.602216 0.666368 -1.689476
H  -6.981041 1.803095 -0.394557
H  -4.043699 2.976423 -0.105895
H  -5.044271 2.498427 1.248136
H  -3.450516 1.776383 1.041472
H  1.833583 3.175451 0.52906
H  1.467932 2.378487 -0.992706
H  1.489566 -1.910363 0.584586
H  1.662931 -1.322836 2.226314
H  3.070644 -1.946012 1.345946
H  5.678125 0.516534 0.047718
H  5.089985 -0.831294 1.008751
H  4.737339 -0.594447 -2.046007
H  5.111941 -2.991743 -2.005439
H  5.281701 -2.957882 -0.172245
totalener: -965.40603732 hartree
nucrepener: 1799.95671003 hartree
electener: -2765.36274735 hartree
oneelecener: -4885.87075462 hartree
twoeener: 2120.50800727 hartree
kineticenergy: 961.03947313 hartree
xcener: -95.137591416517 hartree
chargesum: -0.0000000
charge: -0.270152 -0.388949 -0.329604 0.142750 -0.041535 -0.079958 -0.270011 -0.278818 -0.230616 0.305773 -0.001876 0.214674 -0.210581 -0.229766 -0.136802 -0.066001 -0.042258 0.220609 -0.238179 -0.116200 -0.140951 -0.219961 0.106583 0.081749 0.104065 0.090830 0.079300 0.093758 0.083212 0.091601 0.094571 0.098288 0.084783 0.078786 0.086955 0.085930 0.090185 0.079394 0.086861 0.089149 0.099923 0.122048 0.086618 0.103968 0.088772 0.119205 0.102847 0.079028
qa: -0.2702 -0.3889 -0.3296 0.1427 -0.0415 -0.0800 -0.2700 -0.2788 -0.2306 0.3058 -0.0019 0.2147 -0.2106 -0.2298 -0.1368 -0.0660 -0.0423 0.2206 -0.2382 -0.1162 -0.1410 -0.2200 0.1066 0.0817 0.1041 0.0908 0.0793 0.0938 0.0832 0.0916 0.0946 0.0983 0.0848 0.0788 0.0870 0.0859 0.0902 0.0794 0.0869 0.0891 0.0999 0.1220 0.0866 0.1040 0.0888 0.1192 0.1028 0.0790
va: 2.1216 2.1031 2.1708 3.7326 3.8499 3.8169 3.8930 3.9103 3.8950 4.2261 3.7307 3.7817 3.9415 3.9452 3.8653 3.7510 3.4020 4.1305 3.9350 3.8911 3.8349 3.9573 1.0238 1.0344 1.0169 1.0052 1.0039 1.0001 1.0049 1.0061 1.0092 1.0267 0.9991 1.0097 0.9986 1.0006 1.0017 1.0200 1.0281 1.0328 1.0030 1.0090 1.0131 1.0258 1.0034 1.0100 1.0109 1.0151
dispcorr: -0.023175956 hartree
energy: -965.429213273205
dipole: -18.13800 17.05930 -1.07869 -10.93892 10.11975 -0.81917 -3.16664 3.10156 -0.06508
magnitude: 1.35604 au
magnitude: 3.44679 debye
