program: Orca
programVersion: 5.0.2
elementType: O O O C C C C C C C C C C C C C C C C C C C H H H H H H H H H H H H H H H H H H H H H H H H H H
charge: 0
multiplicity: 1
keywords: wb97x-d3
keywords: def2-TZVPP
keywords: def2/J RIJCOSX
keywords: DEFGRID2
keywords: scfconv7
keywords: smallprint printgap noloewdin
keywords: NOSOSCF
formula: C19H26O3
InChI: InChI=1/C19H26O3/c1-7-8-13-12(4)16(10-15(13)20)22-18(21)17-14(9-11(2)3)19(17,5)6/h7,9,14,16-17H,1,8,10H2,2-6H3
48 atoms
O  0.306339 1.682182 -0.671249
O  0.278039 -0.551854 -0.558273
O  4.661348 -0.09917 -1.337897
C  -2.55852 -0.164389 -1.853933
C  -2.673901 -0.470494 -0.392669
C  -1.764035 0.654465 -0.851589
C  -1.867356 -1.168887 -2.744444
C  -3.680717 0.563413 -2.557099
C  -3.871283 -0.161729 0.407802
C  -0.305643 0.493961 -0.681701
C  -4.379535 -0.893556 1.402553
C  1.720954 1.736696 -0.49181
C  -5.610419 -0.444123 2.133069
C  -3.813991 -2.193622 1.888821
C  2.574735 1.113891 -1.593524
C  2.221131 1.113255 0.788465
C  3.356672 0.430465 0.596498
C  3.683399 0.397052 -0.841134
C  1.514542 1.343563 2.073895
C  4.216642 -0.231393 1.618746
C  3.714627 -1.557631 2.114873
C  2.593232 -2.164298 1.751648
H  -2.126177 -1.357162 -0.093922
H  -2.123467 1.665962 -0.698431
H  -1.097103 -1.73689 -2.228871
H  -2.600288 -1.878557 -3.132093
H  -1.404506 -0.675697 -3.601702
H  -4.479013 -0.132016 -2.821235
H  -4.120687 1.356969 -1.954986
H  -3.317678 1.019481 -3.479426
H  -4.383695 0.763629 0.162338
H  1.90451 2.813661 -0.43885
H  -6.003245 0.494069 1.743035
H  -6.403527 -1.192944 2.065463
H  -5.404943 -0.304861 3.19746
H  -4.536148 -3.002011 1.749143
H  -2.892473 -2.488071 1.392036
H  -3.608255 -2.144632 2.960932
H  2.988162 1.848949 -2.284271
H  2.025463 0.383583 -2.188024
H  2.134064 1.075905 2.927782
H  0.611817 0.731415 2.130224
H  1.202867 2.384084 2.179843
H  5.216221 -0.372734 1.197093
H  4.354265 0.433104 2.478929
H  4.363107 -2.040307 2.839873
H  2.327777 -3.12579 2.17004
H  1.910279 -1.744278 1.025145
totalener: -965.40388316 hartree
nucrepener: 1838.45197456 hartree
electener: -2803.85585772 hartree
oneelecener: -4963.18190815 hartree
twoeener: 2159.32605043 hartree
kineticenergy: 961.04193087 hartree
xcener: -95.143466606473 hartree
chargesum: 0.0000000
charge: -0.275317 -0.411448 -0.328481 0.082119 0.037140 -0.085186 -0.258201 -0.254932 -0.190117 0.336764 -0.051250 0.278503 -0.201537 -0.238680 -0.155163 -0.060604 -0.095670 0.238019 -0.246425 -0.101918 -0.162072 -0.213852 0.093079 0.072650 0.100813 0.088011 0.083496 0.095994 0.072995 0.091113 0.071915 0.098853 0.075712 0.084158 0.084545 0.088232 0.085426 0.084677 0.088982 0.099617 0.096684 0.109692 0.104801 0.095343 0.083462 0.101248 0.093502 0.113305
qa: -0.2753 -0.4114 -0.3285 0.0821 0.0371 -0.0852 -0.2582 -0.2549 -0.1901 0.3368 -0.0512 0.2785 -0.2015 -0.2387 -0.1552 -0.0606 -0.0957 0.2380 -0.2464 -0.1019 -0.1621 -0.2139 0.0931 0.0727 0.1008 0.0880 0.0835 0.0960 0.0730 0.0911 0.0719 0.0989 0.0757 0.0842 0.0845 0.0882 0.0854 0.0847 0.0890 0.0996 0.0967 0.1097 0.1048 0.0953 0.0835 0.1012 0.0935 0.1133
va: 2.1369 2.0690 2.1769 3.7439 3.7839 3.8524 3.9136 3.9174 3.9092 4.2206 3.8296 3.7700 3.9341 3.9441 3.8486 3.6769 3.4574 4.1110 3.9454 3.8624 3.8807 3.9187 1.0305 1.0387 1.0220 1.0018 1.0029 1.0027 1.0107 1.0043 1.0222 0.9909 1.0123 0.9982 0.9987 0.9987 1.0164 0.9994 1.0273 1.0321 1.0041 1.0023 1.0028 1.0232 0.9981 1.0073 1.0129 1.0237
dispcorr: -0.023736686 hartree
energy: -965.427619849191
dipole: -23.73431 22.13703 -1.59728 -5.95163 6.87794 0.92631 6.84623 -6.15220 0.69403
magnitude: 1.97257 au
magnitude: 5.01387 debye
