program: Orca
programVersion: 5.0.2
elementType: O O O C C C C C C C C C C C C C C C C C C C H H H H H H H H H H H H H H H H H H H H H H H H H H
charge: 0
multiplicity: 1
keywords: wb97x-d3
keywords: def2-TZVPP
keywords: def2/J RIJCOSX
keywords: DEFGRID2
keywords: scfconv7
keywords: smallprint printgap noloewdin
keywords: NOSOSCF
formula: C19H26O3
InChI: InChI=1/C19H26O3/c1-7-8-13-12(4)16(10-15(13)20)22-18(21)17-14(9-11(2)3)19(17,5)6/h7,9,14,16-17H,1,8,10H2,2-6H3
48 atoms
O  0.379102 0.461848 -0.159107
O  -0.761791 0.317242 1.767211
O  4.695007 2.081297 -0.741077
C  -2.637101 -1.498154 0.034471
C  -3.244707 -0.136899 0.184211
C  -1.815211 -0.263824 -0.29878
C  -2.351776 -2.298219 1.281778
C  -3.036238 -2.363098 -1.137414
C  -4.275188 0.381774 -0.736073
C  -0.712459 0.195536 0.571057
C  -5.457095 0.901881 -0.397894
C  1.55584 0.929803 0.500727
C  -6.402491 1.404296 -1.447832
C  -5.959051 1.037244 1.00761
C  2.294778 1.928558 -0.379365
C  2.542662 -0.192423 0.72446
C  3.767624 0.131645 0.288614
C  3.740419 1.467395 -0.340323
C  2.118031 -1.443926 1.403476
C  5.037015 -0.65428 0.346717
C  5.268322 -1.380985 -0.947586
C  6.178265 -1.037059 -1.847307
H  -3.319936 0.197114 1.213249
H  -1.646581 -0.099282 -1.357445
H  -3.21646 -2.920031 1.520339
H  -1.500932 -2.966778 1.131559
H  -2.140393 -1.676321 2.14753
H  -3.974443 -2.879228 -0.927047
H  -3.17374 -1.797929 -2.057996
H  -2.274556 -3.120843 -1.329141
H  -4.036166 0.335219 -1.794614
H  1.280092 1.368615 1.463475
H  -7.362365 0.884402 -1.395168
H  -6.616265 2.466717 -1.3066
H  -6.006416 1.274714 -2.454294
H  -6.890999 0.480881 1.134246
H  -5.260429 0.677072 1.759103
H  -6.187913 2.080481 1.237891
H  2.196183 2.963486 -0.052597
H  1.935742 1.87492 -1.409672
H  2.960619 -2.096656 1.623825
H  1.421651 -2.005585 0.776443
H  1.593552 -1.225295 2.334627
H  5.867597 0.02766 0.539725
H  5.007431 -1.366053 1.175417
H  4.608421 -2.220367 -1.145168
H  6.291153 -1.582217 -2.774478
H  6.835156 -0.190466 -1.693833
totalener: -965.40643899 hartree
nucrepener: 1771.94097180 hartree
electener: -2737.34741079 hartree
oneelecener: -4829.90177101 hartree
twoeener: 2092.55436022 hartree
kineticenergy: 961.03862398 hartree
xcener: -95.138108603607 hartree
chargesum: -0.0000000
charge: -0.275463 -0.390461 -0.327298 0.095359 0.040316 -0.099559 -0.263184 -0.240686 -0.191328 0.321098 -0.048246 0.219235 -0.203183 -0.235614 -0.139219 -0.056192 -0.033903 0.220237 -0.253814 -0.131772 -0.149058 -0.192390 0.091703 0.072150 0.089413 0.077171 0.103431 0.093364 0.072393 0.090070 0.073297 0.100098 0.083436 0.085968 0.076799 0.085991 0.082498 0.087464 0.086050 0.088220 0.093139 0.097621 0.118971 0.094814 0.096926 0.104191 0.099228 0.090715
qa: -0.2755 -0.3905 -0.3273 0.0954 0.0403 -0.0996 -0.2632 -0.2407 -0.1913 0.3211 -0.0482 0.2192 -0.2032 -0.2356 -0.1392 -0.0562 -0.0339 0.2202 -0.2538 -0.1318 -0.1491 -0.1924 0.0917 0.0722 0.0894 0.0772 0.1034 0.0934 0.0724 0.0901 0.0733 0.1001 0.0834 0.0860 0.0768 0.0860 0.0825 0.0875 0.0861 0.0882 0.0931 0.0976 0.1190 0.0948 0.0969 0.1042 0.0992 0.0907
va: 2.1249 2.1054 2.1706 3.7217 3.7874 3.9033 3.9087 3.9116 3.8971 4.2380 3.8213 3.7786 3.9355 3.9465 3.8856 3.7231 3.4028 4.1292 3.9363 3.8910 3.8406 3.9750 1.0340 1.0398 1.0032 1.0047 1.0203 1.0045 1.0109 1.0042 1.0209 1.0269 0.9987 0.9982 1.0122 0.9996 1.0151 0.9991 1.0295 1.0311 1.0090 1.0007 1.0077 1.0261 1.0058 1.0091 1.0075 1.0204
dispcorr: -0.022163927 hartree
energy: -965.428602914359
dipole: -22.44989 21.14226 -1.30763 -10.71585 9.78530 -0.93055 -1.35921 1.38275 0.02354
magnitude: 1.60511 au
magnitude: 4.07987 debye
