program: Orca
programVersion: 5.0.2
elementType: O O O C C C C C C C C C C C C C C C C C C C H H H H H H H H H H H H H H H H H H H H H H H H H H
charge: 0
multiplicity: 1
keywords: wb97x-d3
keywords: def2-TZVPP
keywords: def2/J RIJCOSX
keywords: DEFGRID2
keywords: scfconv7
keywords: smallprint printgap noloewdin
keywords: NOSOSCF
formula: C19H26O3
InChI: InChI=1/C19H26O3/c1-7-8-13-12(4)16(10-15(13)20)22-18(21)17-14(9-11(2)3)19(17,5)6/h7,9,14,16-17H,1,8,10H2,2-6H3
48 atoms
O  0.515685 0.798668 -0.070518
O  -0.610682 0.606071 1.859579
O  4.851884 2.118669 -0.850089
C  -2.477381 -1.151122 0.038082
C  -3.103983 0.181663 0.306627
C  -1.693863 0.128864 -0.217973
C  -2.131299 -2.045858 1.202359
C  -2.891573 -1.914102 -1.196658
C  -4.180424 0.747715 -0.547038
C  -0.574831 0.53095 0.659148
C  -5.461699 0.383147 -0.492706
C  1.71727 1.18873 0.596984
C  -6.493926 1.019022 -1.372677
C  -5.974432 -0.670028 0.441204
C  2.49495 2.173374 -0.265798
C  2.639917 0.004599 0.762199
C  3.85525 0.24179 0.250682
C  3.890369 1.583266 -0.363084
C  2.177765 -1.231773 1.443751
C  5.03922 -0.661667 0.232262
C  5.010318 -1.704634 -0.84898
C  4.025678 -1.927478 -1.707985
H  -3.16103 0.442098 1.360915
H  -1.552054 0.369471 -1.26634
H  -1.883123 -1.493484 2.105063
H  -2.981136 -2.692486 1.431111
H  -1.28751 -2.695977 0.96035
H  -2.102025 -2.602017 -1.504231
H  -3.788332 -2.504729 -0.998725
H  -3.114426 -1.258618 -2.037153
H  -3.893046 1.527312 -1.246647
H  1.469926 1.608515 1.57556
H  -6.064007 1.775982 -2.027284
H  -6.988429 0.272537 -1.99924
H  -7.277934 1.494715 -0.778377
H  -6.469326 -1.471769 -0.112558
H  -5.18942 -1.117132 1.047942
H  -6.72454 -0.254322 1.118613
H  2.525289 3.183285 0.143403
H  2.064608 2.242414 -1.266886
H  2.990699 -1.938427 1.598277
H  1.416656 -1.739176 0.846306
H  1.7184 -1.001399 2.405839
H  5.942802 -0.057819 0.108649
H  5.151143 -1.162884 1.199573
H  5.902739 -2.319905 -0.907251
H  4.106624 -2.705731 -2.454133
H  3.111798 -1.347252 -1.709199
totalener: -965.40573893 hartree
nucrepener: 1799.74023146 hartree
electener: -2765.14597039 hartree
oneelecener: -4885.46049002 hartree
twoeener: 2120.31451963 hartree
kineticenergy: 961.05014812 hartree
xcener: -95.141287982237 hartree
chargesum: -0.0000000
charge: -0.275698 -0.386639 -0.324431 0.075147 -0.031536 -0.081254 -0.276069 -0.245013 -0.190157 0.314234 -0.025361 0.238642 -0.209886 -0.242774 -0.148883 -0.091020 -0.070776 0.238802 -0.236995 -0.085131 -0.154208 -0.203734 0.111216 0.081350 0.107954 0.086962 0.081743 0.096062 0.085831 0.085081 0.089913 0.103286 0.080119 0.084577 0.087081 0.087901 0.082817 0.098971 0.086709 0.089447 0.096784 0.094771 0.125435 0.097368 0.085337 0.102044 0.101315 0.082664
qa: -0.2757 -0.3866 -0.3244 0.0751 -0.0315 -0.0813 -0.2761 -0.2450 -0.1902 0.3142 -0.0254 0.2386 -0.2099 -0.2428 -0.1489 -0.0910 -0.0708 0.2388 -0.2370 -0.0851 -0.1542 -0.2037 0.1112 0.0814 0.1080 0.0870 0.0817 0.0961 0.0858 0.0851 0.0899 0.1033 0.0801 0.0846 0.0871 0.0879 0.0828 0.0990 0.0867 0.0894 0.0968 0.0948 0.1254 0.0974 0.0853 0.1020 0.1013 0.0827
va: 2.1246 2.1111 2.1795 3.7152 3.8248 3.8514 3.9024 3.9048 3.8563 4.2615 3.7430 3.7460 3.9384 3.9348 3.8761 3.7103 3.4284 4.1034 3.9401 3.8573 3.8867 3.9304 1.0243 1.0347 1.0183 1.0054 1.0052 1.0057 1.0020 1.0073 1.0130 1.0266 1.0104 0.9990 0.9983 0.9989 1.0111 1.0038 1.0288 1.0315 1.0063 1.0013 1.0071 1.0234 0.9992 1.0094 1.0111 1.0255
dispcorr: -0.024041654 hartree
energy: -965.429780578916
dipole: -24.40805 23.13150 -1.27655 -14.70506 13.71639 -0.98868 -2.21385 2.30980 0.09595
magnitude: 1.61749 au
magnitude: 4.11133 debye
