program: Orca
programVersion: 5.0.2
elementType: O O O C C C C C C C C C C C C C C C C C C C H H H H H H H H H H H H H H H H H H H H H H H H H H
charge: 0
multiplicity: 1
keywords: wb97x-d3
keywords: def2-TZVPP
keywords: def2/J RIJCOSX
keywords: DEFGRID2
keywords: scfconv7
keywords: smallprint printgap noloewdin
keywords: NOSOSCF
formula: C19H26O3
InChI: InChI=1/C19H26O3/c1-7-8-13-12(4)16(10-15(13)20)22-18(21)17-14(9-11(2)3)19(17,5)6/h7,9,14,16-17H,1,8,10H2,2-6H3
48 atoms
O  0.37722 0.468451 -0.134384
O  -0.779543 0.302909 1.78095
O  4.680982 2.057621 -0.758692
C  -2.628856 -1.506752 0.006149
C  -3.245974 -0.151873 0.174209
C  -1.812117 -0.262488 -0.300221
C  -2.346611 -2.326076 1.241527
C  -3.012669 -2.354759 -1.183115
C  -4.268671 0.381141 -0.746195
C  -0.718894 0.192503 0.584034
C  -5.442129 0.921798 -0.410862
C  1.548978 0.933933 0.536655
C  -6.372335 1.446377 -1.463626
C  -5.945261 1.066928 0.993263
C  2.289536 1.939313 -0.33514
C  2.534049 -0.191046 0.753902
C  3.754667 0.123229 0.299575
C  3.728942 1.457938 -0.331317
C  2.111915 -1.438957 1.441153
C  5.016623 -0.67559 0.33453
C  5.206094 -1.416395 -0.958425
C  6.096855 -1.091246 -1.883943
H  -3.330409 0.164605 1.208079
H  -1.637238 -0.080512 -1.355009
H  -2.14311 -1.718029 2.119036
H  -3.209043 -2.956708 1.464675
H  -1.491417 -2.987488 1.084333
H  -2.241811 -3.100648 -1.384316
H  -3.946165 -2.88479 -0.986822
H  -3.151502 -1.774739 -2.094143
H  -4.027758 0.33353 -1.804255
H  1.266801 1.365063 1.501013
H  -7.3407 0.941621 -1.421201
H  -6.56995 2.511134 -1.316625
H  -5.97124 1.317522 -2.468173
H  -6.915502 0.576713 1.102416
H  -5.2806 0.643879 1.742641
H  -6.10108 2.119413 1.241945
H  2.214461 2.967489 0.018569
H  1.910932 1.918555 -1.359398
H  1.40816 -2.001237 0.822986
H  1.596746 -1.215672 2.376366
H  2.954891 -2.093115 1.655818
H  5.85946 -0.001443 0.499496
H  5.00002 -1.379168 1.170586
H  4.531299 -2.249204 -1.132249
H  6.178245 -1.644784 -2.809404
H  6.767288 -0.251176 -1.755079
totalener: -965.40644839 hartree
nucrepener: 1772.97878932 hartree
electener: -2738.38523771 hartree
oneelecener: -4831.97924131 hartree
twoeener: 2093.59400360 hartree
kineticenergy: 961.04102047 hartree
xcener: -95.138415365348 hartree
chargesum: -0.0000000
charge: -0.274706 -0.390402 -0.327387 0.093834 0.043266 -0.096772 -0.262991 -0.241665 -0.192382 0.320173 -0.047357 0.219602 -0.203271 -0.237070 -0.140517 -0.058914 -0.033443 0.220846 -0.253240 -0.131108 -0.148906 -0.192429 0.090881 0.072076 0.103257 0.089624 0.077061 0.090133 0.093301 0.072616 0.072491 0.100138 0.083683 0.085554 0.076705 0.084647 0.083087 0.088971 0.086264 0.088737 0.097400 0.119223 0.093248 0.094490 0.097129 0.104210 0.099199 0.090712
qa: -0.2747 -0.3904 -0.3274 0.0938 0.0433 -0.0968 -0.2630 -0.2417 -0.1924 0.3202 -0.0474 0.2196 -0.2033 -0.2371 -0.1405 -0.0589 -0.0334 0.2208 -0.2532 -0.1311 -0.1489 -0.1924 0.0909 0.0721 0.1033 0.0896 0.0771 0.0901 0.0933 0.0726 0.0725 0.1001 0.0837 0.0856 0.0767 0.0846 0.0831 0.0890 0.0863 0.0887 0.0974 0.1192 0.0932 0.0945 0.0971 0.1042 0.0992 0.0907
va: 2.1243 2.1061 2.1710 3.7233 3.7861 3.8975 3.9088 3.9121 3.9005 4.2398 3.8202 3.7771 3.9356 3.9467 3.8842 3.7263 3.4036 4.1293 3.9370 3.8898 3.8410 3.9753 1.0342 1.0397 1.0202 1.0031 1.0047 1.0041 1.0044 1.0109 1.0213 1.0267 0.9988 0.9980 1.0122 0.9998 1.0146 0.9988 1.0291 1.0316 1.0006 1.0076 1.0087 1.0265 1.0055 1.0091 1.0076 1.0204
dispcorr: -0.022160481 hartree
energy: -965.428608869241
dipole: -22.34358 21.05942 -1.28416 -10.58489 9.68214 -0.90275 -1.53315 1.57433 0.04117
magnitude: 1.57026 au
magnitude: 3.99128 debye
