program: Orca
programVersion: 5.0.2
elementType: O O O C C C C C C C C C C C C C C C C C C C H H H H H H H H H H H H H H H H H H H H H H H H H H
charge: 0
multiplicity: 1
keywords: wb97x-d3
keywords: def2-TZVPP
keywords: def2/J RIJCOSX
keywords: DEFGRID2
keywords: scfconv7
keywords: smallprint printgap noloewdin
keywords: NOSOSCF
formula: C19H26O3
InChI: InChI=1/C19H26O3/c1-7-8-13-12(4)16(10-15(13)20)22-18(21)17-14(9-11(2)3)19(17,5)6/h7,9,14,16-17H,1,8,10H2,2-6H3
48 atoms
O  0.355791 0.422809 -0.088684
O  -0.828649 0.249884 1.809418
O  4.593303 2.117585 -0.754637
C  -2.645213 -1.581753 0.030566
C  -3.262957 -0.221235 0.14047
C  -1.813336 -0.351724 -0.285992
C  -2.407213 -2.365467 1.298196
C  -2.990618 -2.463955 -1.145592
C  -4.256712 0.295581 -0.817631
C  -0.745979 0.129454 0.614955
C  -5.363883 0.962511 -0.487625
C  1.510041 0.914756 0.594334
C  -6.30723 1.467383 -1.535958
C  -5.740384 1.261082 0.940739
C  2.218282 1.960821 -0.256616
C  2.525393 -0.187914 0.782161
C  3.728483 0.155602 0.303568
C  3.66315 1.497896 -0.307939
C  2.141377 -1.451436 1.463449
C  5.003709 -0.622241 0.291567
C  5.162939 -1.346889 -1.014819
C  6.016874 -0.996863 -1.965723
H  -3.381331 0.123938 1.16235
H  -1.608222 -0.197771 -1.339572
H  -1.545983 -3.029038 1.191628
H  -2.236492 -1.73202 2.164489
H  -3.276663 -2.991219 1.507384
H  -2.216957 -3.219166 -1.295062
H  -3.933559 -2.984001 -0.968863
H  -3.09044 -1.912185 -2.079107
H  -4.056004 0.126528 -1.871081
H  1.212963 1.31422 1.56763
H  -5.971148 1.224869 -2.543478
H  -7.305716 1.043143 -1.403181
H  -6.419419 2.552727 -1.472076
H  -5.788189 0.357054 1.549399
H  -5.024146 1.933385 1.417281
H  -6.716858 1.740606 1.000228
H  2.142987 2.972539 0.14212
H  1.812916 1.980235 -1.270341
H  3.002998 -2.083654 1.66991
H  1.449699 -2.028895 0.845622
H  1.62556 -1.247376 2.40284
H  5.840738 0.063476 0.437119
H  5.023689 -1.335024 1.119805
H  4.496283 -2.189015 -1.175087
H  6.074389 -1.537466 -2.900736
H  6.674077 -0.144169 -1.851779
totalener: -965.40508366 hartree
nucrepener: 1774.93068190 hartree
electener: -2740.33576556 hartree
oneelecener: -4835.92000525 hartree
twoeener: 2095.58423969 hartree
kineticenergy: 961.04012066 hartree
xcener: -95.137524577751 hartree
chargesum: -0.0000000
charge: -0.275741 -0.390639 -0.327665 0.086257 0.048332 -0.092437 -0.258189 -0.247117 -0.214106 0.320614 -0.000774 0.219966 -0.216183 -0.287751 -0.143017 -0.060456 -0.034446 0.222908 -0.252701 -0.130597 -0.148258 -0.193079 0.092116 0.072511 0.076856 0.103122 0.088160 0.089669 0.093777 0.072859 0.070425 0.100530 0.073277 0.089611 0.092048 0.099985 0.102651 0.085755 0.086707 0.089231 0.093634 0.098093 0.118125 0.094320 0.097186 0.104158 0.099173 0.091096
qa: -0.2757 -0.3906 -0.3277 0.0863 0.0483 -0.0924 -0.2582 -0.2471 -0.2141 0.3206 -0.0008 0.2200 -0.2162 -0.2878 -0.1430 -0.0605 -0.0344 0.2229 -0.2527 -0.1306 -0.1483 -0.1931 0.0921 0.0725 0.0769 0.1031 0.0882 0.0897 0.0938 0.0729 0.0704 0.1005 0.0733 0.0896 0.0920 0.1000 0.1027 0.0858 0.0867 0.0892 0.0936 0.0981 0.1181 0.0943 0.0972 0.1042 0.0992 0.0911
va: 2.1207 2.1068 2.1710 3.7315 3.7891 3.8893 3.9101 3.9181 3.9368 4.2436 3.7253 3.7734 3.9348 3.9446 3.8839 3.7274 3.4055 4.1279 3.9366 3.8886 3.8403 3.9750 1.0282 1.0391 1.0048 1.0209 1.0028 1.0039 1.0038 1.0109 1.0212 1.0276 1.0140 0.9941 0.9939 0.9964 0.9966 1.0072 1.0285 1.0320 1.0083 1.0007 1.0075 1.0269 1.0054 1.0091 1.0076 1.0205
dispcorr: -0.022146988 hartree
energy: -965.427230643885
dipole: -21.69636 20.47074 -1.22561 -10.30217 9.39864 -0.90353 -1.62385 1.68979 0.06593
magnitude: 1.52408 au
magnitude: 3.87391 debye
