program: Orca
programVersion: 5.0.2
elementType: O O O C C C C C C C C C C C C C C C C C C C H H H H H H H H H H H H H H H H H H H H H H H H H H
charge: 0
multiplicity: 1
keywords: wb97x-d3
keywords: def2-TZVPP
keywords: def2/J RIJCOSX
keywords: DEFGRID2
keywords: scfconv7
keywords: smallprint printgap noloewdin
keywords: NOSOSCF
formula: C19H26O3
InChI: InChI=1/C19H26O3/c1-7-8-13-12(4)16(10-15(13)20)22-18(21)17-14(9-11(2)3)19(17,5)6/h7,9,14,16-17H,1,8,10H2,2-6H3
48 atoms
O  0.144373 0.228631 0.11983
O  -0.939512 -0.060823 2.061652
O  4.137761 2.392525 -0.70192
C  -2.78357 -1.876061 0.254814
C  -3.437592 -0.557548 0.480544
C  -2.005136 -0.59503 -0.014923
C  -2.452329 -2.73809 1.447626
C  -3.134887 -2.673389 -0.977661
C  -4.513364 -0.036685 -0.40323
C  -0.91292 -0.130477 0.855579
C  -4.658148 1.241964 -0.760126
C  1.302973 0.778806 0.750005
C  -5.785401 1.685045 -1.641897
C  -3.71859 2.327735 -0.33292
C  1.83826 1.950815 -0.060458
C  2.423698 -0.229803 0.764844
C  3.556589 0.281654 0.258082
C  3.30762 1.643318 -0.233287
C  2.205983 -1.587278 1.319608
C  4.893953 -0.371286 0.11355
C  4.992222 -1.083941 -1.204026
C  5.797259 -0.730974 -2.197762
H  -3.527281 -0.28152 1.529181
H  -1.861908 -0.367696 -1.065191
H  -2.302796 -2.166234 2.360803
H  -3.273057 -3.434358 1.632637
H  -1.553786 -3.333014 1.270605
H  -2.319075 -3.35056 -1.238637
H  -4.024847 -3.282471 -0.80619
H  -3.325924 -2.041517 -1.845265
H  -5.244474 -0.759066 -0.756671
H  1.064122 1.076306 1.773703
H  -6.416428 0.853427 -1.955653
H  -6.418754 2.415531 -1.131673
H  -5.408545 2.180284 -2.540865
H  -4.272436 3.184216 0.059257
H  -3.011308 2.012794 0.432329
H  -3.143459 2.699199 -1.186054
H  1.686262 2.918338 0.418428
H  1.368499 1.994776 -1.046267
H  3.135173 -2.143875 1.428589
H  1.549316 -2.166819 0.665161
H  1.715582 -1.539367 2.293739
H  5.68039 0.38275 0.189852
H  5.051788 -1.081382 0.929118
H  4.328738 -1.935383 -1.329445
H  5.81296 -1.281578 -3.130186
H  6.469152 0.116179 -2.120215
elementType: O C H
totalener: -965.42819358 hartree
nucrepener: 1796.05029527 hartree
electener: -2761.47848886 hartree
oneelecener: -4878.19410087 hartree
twoeener: 2116.71561202 hartree
cpcmener: -0.02851657 hartree
kineticenergy: 960.99295764 hartree
xcener: -95.136030449488 hartree
chargesum: -0.0000000
charge: -0.293573 -0.471896 -0.447168 0.151914 -0.021480 -0.106841 -0.280600 -0.284551 -0.296909 0.383238 -0.009846 0.246070 -0.228399 -0.243617 -0.137581 -0.030709 -0.065912 0.283040 -0.254948 -0.108322 -0.179196 -0.274546 0.104643 0.092277 0.093857 0.096194 0.095393 0.097492 0.098246 0.092982 0.120653 0.102634 0.089052 0.096512 0.093968 0.100970 0.081880 0.101860 0.098646 0.099518 0.105715 0.113019 0.113929 0.089981 0.111981 0.139888 0.128292 0.112253
qa: -0.2936 -0.4719 -0.4472 0.1519 -0.0215 -0.1068 -0.2806 -0.2846 -0.2969 0.3832 -0.0098 0.2461 -0.2284 -0.2436 -0.1376 -0.0307 -0.0659 0.2830 -0.2549 -0.1083 -0.1792 -0.2745 0.1046 0.0923 0.0939 0.0962 0.0954 0.0975 0.0982 0.0930 0.1207 0.1026 0.0891 0.0965 0.0940 0.1010 0.0819 0.1019 0.0986 0.0995 0.1057 0.1130 0.1139 0.0900 0.1120 0.1399 0.1283 0.1123
va: 2.1133 2.0322 2.0536 3.6966 3.8219 3.8196 3.8922 3.9069 3.8936 4.1566 3.7048 3.7627 3.9330 3.9375 3.9048 3.7462 3.4360 4.0771 3.9343 3.8648 3.7974 3.9525 1.0245 1.0318 1.0181 1.0017 1.0007 1.0028 1.0001 1.0024 1.0041 1.0317 1.0065 0.9963 0.9962 1.0000 1.0133 0.9978 1.0247 1.0291 1.0044 0.9992 1.0076 1.0251 1.0033 1.0002 1.0028 1.0130
dispcorr: -0.022987507 hartree
energy: -965.451181090903
dipole: -16.90779 15.50926 -1.39853 -8.64459 7.27889 -1.36570 -4.78417 4.71431 -0.06986
magnitude: 1.95599 au
magnitude: 4.97174 debye
