program: Orca
programVersion: 5.0.2
elementType: O O O C C C C C C C C C C C C C C C C C C C H H H H H H H H H H H H H H H H H H H H H H H H H H
charge: 0
multiplicity: 1
keywords: wb97x-d3
keywords: def2-TZVPP
keywords: def2/J RIJCOSX
keywords: DEFGRID2
keywords: scfconv7
keywords: smallprint printgap noloewdin
keywords: NOSOSCF
formula: C19H26O3
InChI: InChI=1/C19H26O3/c1-7-8-13-12(4)16(10-15(13)20)22-18(21)17-14(9-11(2)3)19(17,5)6/h7,9,14,16-17H,1,8,10H2,2-6H3
48 atoms
O  0.455806 0.035633 0.200276
O  -0.892105 0.323548 1.968053
O  4.228868 2.606895 -0.46023
C  -2.72144 -1.66599 0.349396
C  -3.218411 -0.264383 0.174122
C  -1.751111 -0.577469 -0.076283
C  -2.675781 -2.237371 1.745376
C  -3.025192 -2.709485 -0.699879
C  -4.07231 0.162942 -0.949721
C  -0.723013 -0.030492 0.826368
C  -5.063844 1.05529 -0.860178
C  1.588834 0.597566 0.865091
C  -5.881699 1.426082 -2.059064
C  -5.439184 1.740735 0.427971
C  2.010315 1.925006 0.248196
C  2.768068 -0.316717 0.666141
C  3.837598 0.342248 0.194082
C  3.477381 1.741583 -0.064479
C  2.667124 -1.754173 1.009611
C  5.20009 -0.193094 -0.080257
C  5.347936 -0.896112 -1.397687
C  4.382887 -1.167526 -2.267177
H  -3.398981 0.253868 1.110396
H  -1.449025 -0.628278 -1.116304
H  -2.572303 -1.480169 2.519352
H  -3.60229 -2.779552 1.94529
H  -1.852379 -2.946151 1.853903
H  -4.03064 -3.113449 -0.560684
H  -2.959814 -2.32545 -1.717565
H  -2.321812 -3.540971 -0.621574
H  -3.867144 -0.28116 -1.919032
H  1.382725 0.697441 1.933142
H  -5.816389 2.498813 -2.261492
H  -5.565725 0.894784 -2.957128
H  -6.941138 1.209587 -1.895205
H  -6.206596 2.49696 0.263378
H  -5.83667 1.038491 1.163721
H  -4.588507 2.242264 0.893025
H  1.850605 2.781215 0.904259
H  1.467967 2.1207 -0.680287
H  3.63592 -2.249244 0.99906
H  2.021432 -2.27478 0.299097
H  2.218324 -1.888832 1.995883
H  5.927757 0.623074 -0.039643
H  5.50302 -0.88343 0.71417
H  6.361392 -1.211379 -1.626243
H  4.602344 -1.684932 -3.192042
H  3.351489 -0.874424 -2.110738
elementType: O C H
totalener: -965.42817312 hartree
nucrepener: 1780.78641342 hartree
electener: -2746.21458655 hartree
oneelecener: -4847.70461975 hartree
twoeener: 2101.49003321 hartree
cpcmener: -0.02933444 hartree
kineticenergy: 960.99402167 hartree
xcener: -95.138509414326 hartree
chargesum: 0.0000000
charge: -0.299533 -0.470059 -0.446611 0.100071 0.039065 -0.110669 -0.274043 -0.275547 -0.293331 0.405326 -0.009842 0.267110 -0.223813 -0.285425 -0.145378 -0.044473 -0.091989 0.309940 -0.264874 -0.072197 -0.185538 -0.274879 0.091846 0.088554 0.092602 0.096592 0.096902 0.098733 0.088769 0.096970 0.114393 0.105762 0.096158 0.084555 0.097915 0.095058 0.105926 0.100898 0.099852 0.098708 0.103940 0.111021 0.119353 0.091057 0.102698 0.130036 0.129981 0.108413
qa: -0.2995 -0.4701 -0.4466 0.1001 0.0391 -0.1107 -0.2740 -0.2755 -0.2933 0.4053 -0.0098 0.2671 -0.2238 -0.2854 -0.1454 -0.0445 -0.0920 0.3099 -0.2649 -0.0722 -0.1855 -0.2749 0.0918 0.0886 0.0926 0.0966 0.0969 0.0987 0.0888 0.0970 0.1144 0.1058 0.0962 0.0846 0.0979 0.0951 0.1059 0.1009 0.0999 0.0987 0.1039 0.1110 0.1194 0.0911 0.1027 0.1300 0.1300 0.1084
va: 2.1194 2.0438 2.0608 3.7004 3.7874 3.8455 3.9062 3.9162 3.9104 4.1769 3.6967 3.7191 3.9210 3.9403 3.9072 3.7055 3.4566 4.0525 3.9438 3.8292 3.8440 3.9030 1.0278 1.0362 1.0190 1.0003 0.9997 1.0008 1.0067 1.0017 1.0119 1.0350 0.9929 1.0103 0.9925 1.0046 0.9950 0.9976 1.0252 1.0269 1.0030 0.9999 1.0007 1.0218 0.9993 1.0026 1.0049 1.0187
dispcorr: -0.022107060 hartree
energy: -965.450280182106
dipole: -21.08817 19.97902 -1.10916 -10.73769 8.84816 -1.88952 -3.80735 3.84176 0.03441
magnitude: 2.19128 au
magnitude: 5.56980 debye
