program: Orca
programVersion: 5.0.2
elementType: O O O C C C C C C C C C C C C C C C C C C C H H H H H H H H H H H H H H H H H H H H H H H H H H
charge: 0
multiplicity: 1
keywords: wb97x-d3
keywords: def2-TZVPP
keywords: def2/J RIJCOSX
keywords: DEFGRID2
keywords: scfconv7
keywords: smallprint printgap noloewdin
keywords: NOSOSCF
formula: C19H26O3
InChI: InChI=1/C19H26O3/c1-7-8-13-12(4)16(10-15(13)20)22-18(21)17-14(9-11(2)3)19(17,5)6/h7,9,14,16-17H,1,8,10H2,2-6H3
48 atoms
O  0.519361 -0.377165 0.404923
O  -0.873961 0.540697 1.889581
O  3.900688 2.697973 -0.192583
C  -2.847982 -1.594821 0.606629
C  -3.168019 -0.20164 0.156992
C  -1.743759 -0.715988 0.045177
C  -2.908858 -1.896285 2.083882
C  -3.244386 -2.769998 -0.254106
C  -3.935983 0.110229 -1.062431
C  -0.69674 -0.11549 0.891007
C  -4.845334 1.08575 -1.157987
C  1.639615 0.226663 1.057379
C  -5.582603 1.337147 -2.4376
C  -5.203416 1.990661 -0.007316
C  1.863121 1.675767 0.639299
C  2.876299 -0.505945 0.611172
C  3.808851 0.33039 0.130287
C  3.289136 1.704129 0.136772
C  2.973552 -1.976407 0.767547
C  5.177473 -0.006996 -0.354351
C  5.243224 -0.551491 -1.752081
C  4.219357 -0.852215 -2.540975
H  -3.312332 0.493899 0.977479
H  -1.405878 -0.994269 -0.947075
H  -2.715203 -1.025445 2.706698
H  -3.904404 -2.264042 2.340624
H  -2.192744 -2.673536 2.358403
H  -2.640253 -3.644566 -0.004795
H  -4.29087 -3.033919 -0.087868
H  -3.115783 -2.579046 -1.318848
H  -3.735503 -0.496892 -1.940121
H  1.530124 0.129909 2.141397
H  -5.410407 2.356458 -2.79439
H  -5.285608 0.648995 -3.22914
H  -6.662535 1.241633 -2.294424
H  -5.687096 1.445269 0.805983
H  -4.329431 2.487731 0.417736
H  -5.89477 2.772483 -0.321746
H  1.721333 2.38894 1.451546
H  1.191361 1.967535 -0.172082
H  3.957403 -2.356706 0.499587
H  2.236925 -2.482168 0.139656
H  2.758069 -2.268611 1.798095
H  5.813227 0.881288 -0.296396
H  5.644211 -0.735386 0.316463
H  6.252054 -0.717313 -2.118672
H  4.38724 -1.248804 -3.534418
H  3.186509 -0.709105 -2.246164
elementType: O C H
totalener: -965.42945550 hartree
nucrepener: 1783.44596726 hartree
electener: -2748.87542276 hartree
oneelecener: -4853.12630358 hartree
twoeener: 2104.25088081 hartree
cpcmener: -0.02963855 hartree
kineticenergy: 960.98376003 hartree
xcener: -95.136096123922 hartree
chargesum: 0.0000000
charge: -0.298846 -0.471256 -0.445859 0.095358 0.040860 -0.087674 -0.269390 -0.274347 -0.296613 0.389254 -0.010125 0.265622 -0.223251 -0.283960 -0.152473 -0.062963 -0.080650 0.311175 -0.259529 -0.068413 -0.186304 -0.276319 0.089542 0.088503 0.090398 0.096812 0.097161 0.096848 0.098122 0.088719 0.115340 0.105153 0.096339 0.084092 0.097945 0.106506 0.100476 0.094657 0.102036 0.103754 0.099060 0.111477 0.118986 0.091299 0.102051 0.130714 0.130151 0.109559
qa: -0.2988 -0.4713 -0.4459 0.0954 0.0409 -0.0877 -0.2694 -0.2743 -0.2966 0.3893 -0.0101 0.2656 -0.2233 -0.2840 -0.1525 -0.0630 -0.0806 0.3112 -0.2595 -0.0684 -0.1863 -0.2763 0.0895 0.0885 0.0904 0.0968 0.0972 0.0968 0.0981 0.0887 0.1153 0.1052 0.0963 0.0841 0.0979 0.1065 0.1005 0.0947 0.1020 0.1038 0.0991 0.1115 0.1190 0.0913 0.1021 0.1307 0.1302 0.1096
va: 2.1244 2.0369 2.0631 3.7139 3.7737 3.8567 3.9049 3.9153 3.9063 4.1717 3.6992 3.7320 3.9211 3.9395 3.9033 3.7295 3.4453 4.0503 3.9488 3.8239 3.8441 3.9038 1.0305 1.0346 1.0188 1.0002 1.0001 1.0019 1.0014 1.0063 1.0114 1.0204 0.9930 1.0104 0.9924 0.9947 0.9983 1.0046 1.0252 1.0232 1.0035 1.0021 0.9988 1.0226 0.9987 1.0023 1.0047 1.0184
dispcorr: -0.022109404 hartree
energy: -965.451564906027
dipole: -20.30239 19.48111 -0.82128 -9.93416 7.65301 -2.28114 -4.90305 4.90290 -0.00015
magnitude: 2.42448 au
magnitude: 6.16255 debye
