program: Gaussian 09
title: 000060770
version: EM64L-G09RevD.01
frameworkgroup: C1[X(C23H19F5N6O2)]
method: RPBEPBE
basis: SDD
operation: Freq
keyword: #p
keyword: freq=noraman
keyword: PBEPBE/SDD
title: #p freq=noraman PBEPBE/SDD
converged: YES YES NO NO
title: Mulliken charges:
elementType: F F F F F O O N N N N N N C C C C C C C C C C C C C C C C C C C C C C C H H H H H H H H H H H H H H H H H H H
charge: -0.158052 -0.161113 -0.138816 -0.138636 -0.139423 -0.401341 -0.273181 -0.186633 -0.105340 -0.034120 -0.128881 -0.358427 -0.011955 0.204387 -0.613734 0.150104 -0.453141 0.127533 0.517424 -0.358923 0.127712 -0.369698 -0.448915 0.133509 0.302497 -0.697244 0.346645 -0.396654 -0.339128 0.216007 0.239412 -0.381269 -0.355264 -0.233047 -0.082180 -0.240340 0.234073 0.290330 0.202502 0.274125 0.229334 0.201573 0.254568 0.230128 0.196080 0.253796 0.218619 0.248755 0.264146 0.254328 0.396323 0.257474 0.235119 0.236536 0.362417
chargesum: 0.00000
title: Mulliken charges with hydrogens summed into heavy atoms:
elementType: F F F F F O O N N N N N N C C C C C C C C C C C C C C C C C C C C C C C
charge: -0.158052 -0.161113 -0.138816 -0.138636 -0.139423 -0.005018 -0.273181 -0.186633 -0.105340 -0.034120 -0.128881 0.003989 -0.011955 0.204387 -0.089330 0.150104 0.023485 0.127533 0.517424 0.071984 0.127712 -0.115130 -0.218786 0.133509 0.302497 -0.028749 0.346645 -0.147899 -0.074982 0.216007 0.239412 -0.126940 -0.097790 0.002072 -0.082180 -0.003805
polarizability: 3.62717538e+02 1.19389193e+01 3.22736086e+02 2.31552416e+01 1.13240241e+01 2.25912095e+02
1716.lowfreq: -6.2871 -1.6871 -0.0010 -0.0008 -0.0004 2.8705 8.3083 10.1124 15.3372
frequency: 8.1046 9.9796 15.3133 17.3671 25.7123 30.9223 46.2523 53.0622 57.3230 67.0145 71.6253 77.2310 87.7167 99.0052 108.6811 132.8285 135.6260 144.3494 159.7542 182.2239 191.3142 210.3776 218.1460 226.9670 254.1458 261.7656 271.0013 276.3264 284.8101 287.7733 316.3910 329.8229 340.1092 350.7772 364.1386 379.3106 388.7652 399.3258 406.8360 442.6647 452.1573 462.4027 485.9709 503.7199 523.2677 546.9057 552.1905 555.9924 559.7240 583.7326 612.8615 634.1126 636.7129 640.2498 651.0338 655.9514 663.6526 692.6985 706.6983 721.3784 723.6501 731.1707 743.9331 750.6875 757.4377 776.2886 783.3447 808.6653 818.2224 844.1575 851.3298 860.9914 882.5023 888.3210 901.2690 912.1354 945.4851 950.4851 963.9329 966.2789 969.6111 973.8633 994.9728 995.0938 995.2958 995.5980 1022.8445 1036.9539 1037.9513 1048.6930 1063.3218 1067.7290 1079.0391 1080.4174 1085.1161 1097.6250 1111.2518 1114.3115 1125.9212 1155.0774 1179.6885 1186.5766 1197.8007 1199.4767 1200.8984 1214.7641 1216.4659 1225.9512 1264.5495 1268.7881 1284.5094 1297.5861 1307.3788 1313.3143 1328.6137 1345.6835 1349.2811 1356.2740 1369.8679 1374.0233 1390.3051 1396.4394 1406.0466 1412.0508 1414.3384 1444.2457 1450.3400 1464.4866 1466.8695 1475.4893 1488.9141 1492.9171 1499.5611 1514.8179 1517.3388 1571.2634 1579.9503 1607.8639 1621.7934 1628.1531 2959.7086 2977.2513 2997.7045 3011.3417 3031.4920 3054.1515 3074.7522 3092.3658 3099.8467 3119.9522 3130.6429 3132.6804 3143.8630 3153.9466 3156.0865 3170.7036 3181.4271 3531.6296 3602.5038
redmass: 6.9424 8.0574 7.4010 7.1645 8.2353 4.2702 7.2632 5.4383 6.9729 5.0971 5.2996 8.3092 6.1226 4.9041 5.5331 4.4307 4.2591 3.6277 4.7264 5.8661 5.3435 5.9661 2.2747 8.9415 5.1339 5.1718 3.9987 6.5402 3.9022 6.1861 10.7082 9.0603 3.9050 6.8274 5.2601 3.3903 6.1667 2.4542 2.9380 9.2459 5.3551 14.8081 5.5291 3.9254 6.6547 3.8766 1.8268 3.1681 3.2547 5.6924 4.0876 7.5342 8.2786 6.1159 5.6216 6.0551 6.1064 6.3643 4.8342 2.1494 1.6913 3.7831 3.7532 6.0606 2.4959 2.5657 2.3159 2.2527 3.0559 1.4012 1.6733 2.4227 2.8905 1.4526 1.9386 5.5286 4.8794 1.7526 1.4080 12.3834 1.7855 1.5833 5.7741 2.6972 4.0070 3.2405 2.8230 6.9974 4.4947 2.9938 1.7788 12.3504 3.2998 2.8311 2.0402 6.0474 2.2424 2.2899 1.4540 5.4123 1.0840 4.8061 1.3087 3.2406 1.4333 2.9857 3.1975 1.3896 1.4278 2.0568 1.9465 1.9698 2.8035 1.9115 2.4843 1.4707 1.6423 5.8179 2.1110 3.6976 1.2624 1.5750 2.9114 2.8226 2.6201 2.7716 1.2062 1.1373 1.1862 1.0557 1.2411 2.4569 3.1819 8.5933 3.5917 6.7214 7.2495 6.1385 6.4208 7.8976 1.0605 1.0375 1.0725 1.0871 1.0617 1.0986 1.0994 1.1004 1.1021 1.0903 1.0877 1.0858 1.0897 1.0964 1.0949 1.1009 1.0946 1.0644 1.0845
irintensity: 0.1918 0.0638 1.3380 0.1816 3.1563 0.3613 0.5846 0.3180 0.1587 0.1774 0.2732 1.5849 0.3521 0.2184 1.8153 0.3126 0.4673 0.6623 0.5525 3.1201 3.4438 3.1740 1.3620 1.2771 2.8943 3.2552 2.7256 0.9756 1.7193 0.8551 0.1606 1.7053 1.3527 1.4052 5.7231 6.3237 1.0907 4.2371 0.1975 4.0705 3.7722 5.4338 7.2330 4.6637 6.6105 1.3117 80.1868 45.9875 22.3215 10.4045 30.3225 6.5140 8.9713 11.5802 9.4176 12.2783 18.9234 20.4167 23.1983 23.1759 80.2949 26.6490 25.9146 7.7325 29.6827 20.8249 23.5614 8.0991 9.3445 21.4108 39.0924 7.5409 113.2249 0.6107 9.0290 5.8575 13.7684 2.0365 2.3319 97.7943 28.4305 12.9536 22.0126 2.2554 8.1739 12.6068 6.2741 141.5812 11.1935 401.6295 10.1863 236.4462 154.9491 79.8942 35.6946 7.2707 5.9487 14.8660 6.7490 3.0998 0.0973 18.0343 4.4778 5.5736 9.6826 10.8452 10.9449 10.2535 6.1022 1.2070 2.2127 33.9489 10.6994 1.7640 4.4942 6.6415 65.6669 7.1412 43.8633 3.6372 30.6138 4.9667 6.2608 88.1752 12.9704 36.7071 9.7684 5.0078 66.9628 10.1433 5.7281 30.0694 30.2579 200.7063 18.7942 0.5209 5.7628 8.2439 9.3196 289.8563 19.3661 36.2813 19.1627 20.9098 22.8752 7.0888 44.9293 44.6654 11.8147 19.2256 7.9976 0.0702 7.8577 4.1944 16.8793 23.8970 3.4248 86.4613 124.7529
temp: 298.150 k
press: 1.00000 atm
elementType: 9 9 9 9 9 8 8 7 7 7 7 7 7 6 6 6 6 6 6 6 6 6 6 6 6 6 6 6 6 6 6 6 6 6 6 6 1 1 1 1 1 1 1 1 1 1 1 1 1 1 1 1 1 1 1
symmnumber: 1
zpe: 1031360.3 jmol-1
zpe.correction: 0.392824 hartree
zpe.thermalcorrener: 0.425432 hartree
zpe.thermalcorrenthalpy: 0.426377 hartree
zpe.thermalcorrgfe: 0.322111 hartree
zpe.sumelectzpe: -1863.404802 hartree
zpe.sumelectthermal: -1863.372194 hartree
zpe.sumelectthermalent: -1863.371249 hartree
zpe.sumelectthermalfe: -1863.475515 hartree
dipole: -6.7768 -0.4779 1.7601
dipole: 7.0180
quadrupole: -211.9810 -186.5457 -201.9660
quadrupole: -10.7948 20.0963 -0.7611
quadrupole: -11.8168 13.6185 -1.8017 -10.7948 20.0963 -0.7611
hfenergy: -1863.7976261 hartree
pointgroup: C01 [X(C23H19F5N6O2)]
dipole: -2.6314336 -0.7043733 0.4505409 debye
polarizability: 367.2298588|-17.5526442|226.618363|9.4848914|16.5168344|317.5174967 unknown
InChI: InChI=1S/C23H19F5N6O2/c1-2-5-17-29-19(22(24,25)23(26,27)28)18(21(35)36)34(17)12-13-8-10-14(11-9-13)15-6-3-4-7-16(15)20-30-32-33-31-20/h3-4,6-11,32,35H,2,5,12H2,1H3
charge 0 multiplicity 1
55 atoms
F  5.620238 0.098029 -2.150927
F  4.046713 1.758053 -2.304837
F  5.984135 0.694647 0.599818
F  4.407181 2.334346 0.462908
F  6.249757 2.413213 -0.841015
O  3.461219 -0.54262 -3.899954
O  1.56368 -1.868876 -3.757676
N  1.85361 -1.688536 -0.778111
N  3.280293 -0.36585 0.373531
N  -4.186512 2.057408 2.719719
N  -3.199328 -0.01947 2.691102
N  -3.280063 1.883131 3.724796
N  -2.658958 0.641525 3.741962
C  2.275524 -1.270804 0.482161
C  0.742693 -2.657501 -1.025091
C  2.635295 -1.013746 -1.740103
C  1.680967 -1.746833 1.777946
C  3.512459 -0.201662 -0.981867
C  -0.634887 -2.04053 -0.8088
C  2.523525 -1.361437 3.017689
C  4.573102 0.754509 -1.426688
C  -1.116044 -1.029669 -1.678525
C  -1.460601 -2.471635 0.256546
C  2.471467 -1.203329 -3.184508
C  -3.202373 -0.860618 -0.37575
C  3.87271 -2.106262 3.104386
C  5.295883 1.543663 -0.275279
C  -2.384734 -0.454386 -1.466116
C  -2.727021 -1.889635 0.474906
C  -4.560213 -0.243689 -0.214765
C  -4.976243 0.537313 0.910985
C  -5.471846 -0.395261 -1.295446
C  -6.272335 1.126657 0.915315
C  -6.757518 0.182489 -1.276124
C  -4.117666 0.843062 2.071747
C  -7.161412 0.950892 -0.160828
H  0.894824 -3.51146 -0.342314
H  0.849957 -3.006146 -2.063334
H  1.555959 -2.849347 1.744753
H  0.658037 -1.329559 1.875218
H  2.705831 -0.271663 3.002657
H  1.915918 -1.579574 3.916862
H  -0.503219 -0.704149 -2.526262
H  -1.113244 -3.265858 0.928862
H  3.7275 -3.203821 3.108965
H  4.521636 -1.841165 2.251996
H  4.409475 -1.834677 4.031224
H  -2.744103 0.33189 -2.139906
H  -3.341879 -2.226669 1.312299
H  -5.156951 -0.992602 -2.158009
H  3.306074 -0.666877 -4.874521
H  -6.566988 1.732389 1.778222
H  -7.436879 0.033117 -2.122197
H  -8.155759 1.408393 -0.130776
H  -3.067389 2.610186 4.407552
