program: Orca
programVersion: 5.0.2
elementType: O O O C C C C C C C C C C C C C C C C C C C H H H H H H H H H H H H H H H H H H H H H H H H H H
charge: 0
multiplicity: 1
keywords: wb97x-d3
keywords: def2-TZVPP
keywords: def2/J RIJCOSX
keywords: DEFGRID2
keywords: scfconv7
keywords: smallprint printgap noloewdin
keywords: NOSOSCF
formula: C19H26O3
InChI: InChI=1/C19H26O3/c1-7-8-13-12(4)16(10-15(13)20)22-18(21)17-14(9-11(2)3)19(17,5)6/h7,9,14,16-17H,1,8,10H2,2-6H3
48 atoms
O  0.345519 0.87738 1.18697
O  -0.002719 0.280871 -0.940083
O  4.471696 1.415147 -1.130275
C  -2.842612 1.510658 -0.395293
C  -2.918591 0.019164 -0.276311
C  -1.855868 0.773817 0.495559
C  -2.402029 2.107937 -1.708778
C  -3.865112 2.354995 0.325119
C  -3.993269 -0.664593 0.478122
C  -0.436068 0.613033 0.137196
C  -4.916458 -1.482722 -0.036046
C  1.760955 0.742488 1.07362
C  -5.946222 -2.127801 0.841627
C  -5.02528 -1.824997 -1.49026
C  2.470471 1.769234 0.19882
C  2.232968 -0.596974 0.568786
C  3.269209 -0.463258 -0.273703
C  3.54206 0.959581 -0.496641
C  1.633175 -1.857042 1.072974
C  4.104162 -1.536753 -0.882293
C  5.320166 -1.904548 -0.081833
C  5.639941 -1.44912 1.123047
H  -2.541425 -0.511175 -1.145077
H  -2.036527 0.888635 1.558931
H  -3.280299 2.326396 -2.319808
H  -1.868607 3.048652 -1.555882
H  -1.760479 1.448047 -2.288225
H  -4.786317 2.419404 -0.257911
H  -4.123128 1.961086 1.307712
H  -3.491903 3.371386 0.465925
H  -4.021777 -0.477195 1.547956
H  2.094712 0.84446 2.1095
H  -5.903428 -3.217556 0.762696
H  -5.81808 -1.86247 1.89124
H  -6.95668 -1.836877 0.541825
H  -4.285511 -1.327017 -2.11446
H  -4.924014 -2.902341 -1.64578
H  -6.012781 -1.552135 -1.872209
H  2.901533 2.593405 0.767548
H  1.810381 2.205084 -0.55449
H  0.737232 -2.113869 0.501423
H  1.328629 -1.76216 2.116369
H  2.323709 -2.695503 0.992521
H  3.50678 -2.438503 -1.045908
H  4.428572 -1.226764 -1.880494
H  5.979345 -2.620704 -0.563463
H  6.543556 -1.780628 1.618944
H  5.029507 -0.73296 1.660336
elementType: O C H
totalener: -965.42611912 hartree
nucrepener: 1807.40347787 hartree
electener: -2772.82959699 hartree
oneelecener: -4901.38816117 hartree
twoeener: 2128.55856418 hartree
cpcmener: -0.03135570 hartree
kineticenergy: 960.99592842 hartree
xcener: -95.141573700305 hartree
chargesum: -0.0000000
charge: -0.298236 -0.467156 -0.453446 0.141008 0.017638 -0.140222 -0.288935 -0.261262 -0.277695 0.400228 -0.033540 0.288094 -0.224097 -0.253035 -0.147864 0.004230 -0.134897 0.289297 -0.266908 -0.092206 -0.183757 -0.273907 0.096512 0.086418 0.095435 0.098257 0.094007 0.096000 0.087498 0.097780 0.118168 0.115869 0.093434 0.088185 0.093478 0.089628 0.096390 0.094968 0.100789 0.111158 0.119458 0.113158 0.107216 0.099274 0.095048 0.130303 0.130433 0.107805
qa: -0.2982 -0.4672 -0.4534 0.1410 0.0176 -0.1402 -0.2889 -0.2613 -0.2777 0.4002 -0.0335 0.2881 -0.2241 -0.2530 -0.1479 0.0042 -0.1349 0.2893 -0.2669 -0.0922 -0.1838 -0.2739 0.0965 0.0864 0.0954 0.0983 0.0940 0.0960 0.0875 0.0978 0.1182 0.1159 0.0934 0.0882 0.0935 0.0896 0.0964 0.0950 0.1008 0.1112 0.1195 0.1132 0.1072 0.0993 0.0950 0.1303 0.1304 0.1078
va: 2.1354 2.0437 2.0498 3.6759 3.7637 3.9171 3.9042 3.9035 3.8756 4.1583 3.7273 3.7698 3.9247 3.9453 3.8832 3.6363 3.4532 4.0745 3.9374 3.8508 3.8321 3.9073 1.0282 1.0423 1.0006 0.9996 1.0195 1.0031 1.0044 1.0026 1.0091 0.9937 0.9958 1.0086 0.9963 1.0087 0.9974 0.9974 1.0266 1.0253 0.9983 1.0023 1.0005 1.0018 1.0160 1.0030 1.0041 1.0159
dispcorr: -0.023255479 hartree
energy: -965.449374600997
dipole: -23.57603 21.32902 -2.24702 -7.13403 6.26075 -0.87327 0.98848 0.61403 1.60251
magnitude: 2.89478 au
magnitude: 7.35794 debye
