program: Orca
programVersion: 5.0.2
elementType: O O O C C C C C C C C C C C C C C C C C C C H H H H H H H H H H H H H H H H H H H H H H H H H H
charge: 0
multiplicity: 1
keywords: wb97x-d3
keywords: def2-TZVPP
keywords: def2/J RIJCOSX
keywords: DEFGRID2
keywords: scfconv7
keywords: smallprint printgap noloewdin
keywords: NOSOSCF
formula: C19H26O3
InChI: InChI=1/C19H26O3/c1-7-8-13-12(4)16(10-15(13)20)22-18(21)17-14(9-11(2)3)19(17,5)6/h7,9,14,16-17H,1,8,10H2,2-6H3
48 atoms
O  0.181284 -0.470901 0.185119
O  -0.878848 -0.035437 2.100504
O  3.508222 2.719702 0.249888
C  -3.179933 -1.680753 0.682676
C  -3.474028 -0.220983 0.619437
C  -2.11735 -0.719182 0.1661
C  -3.028216 -2.341643 2.030464
C  -3.770161 -2.593802 -0.364946
C  -4.424096 0.354283 -0.368467
C  -0.913867 -0.376904 0.941408
C  -4.226049 1.473254 -1.070105
C  1.437868 -0.14645 0.785016
C  -5.25263 1.980376 -2.036475
C  -2.984908 2.306555 -0.970677
C  1.652481 1.34765 0.998362
C  2.511985 -0.563455 -0.185813
C  3.353465 0.443932 -0.464462
C  2.929514 1.653646 0.251476
C  2.581686 -1.962534 -0.669523
C  4.59266 0.396964 -1.302078
C  5.750404 -0.136906 -0.511217
C  6.441028 -1.22627 -0.826697
H  -3.45505 0.277777 1.586536
H  -1.957988 -0.758493 -0.905731
H  -2.694816 -1.658295 2.808754
H  -3.990713 -2.748987 2.347319
H  -2.321314 -3.172832 1.985819
H  -3.163949 -3.495409 -0.472618
H  -4.77747 -2.907484 -0.081972
H  -3.832911 -2.120887 -1.345378
H  -5.362342 -0.178451 -0.501881
H  1.549141 -0.708078 1.717835
H  -4.827955 2.087696 -3.038568
H  -6.117157 1.319822 -2.106251
H  -5.6086 2.972555 -1.746107
H  -2.325067 2.01055 -0.156225
H  -2.410925 2.258864 -1.901417
H  -3.241843 3.358794 -0.821926
H  1.744286 1.621546 2.049772
H  0.838067 1.943697 0.578423
H  3.39377 -2.118083 -1.376517
H  1.648515 -2.260721 -1.151535
H  2.729131 -2.644507 0.172241
H  4.431976 -0.216827 -2.190751
H  4.823736 1.407161 -1.652312
H  6.013226 0.420526 0.383994
H  7.267234 -1.567537 -0.215269
H  6.216645 -1.811789 -1.712373
elementType: O C H
totalener: -965.42898917 hartree
nucrepener: 1794.25264561 hartree
electener: -2759.68163478 hartree
oneelecener: -4874.60639349 hartree
twoeener: 2114.92475870 hartree
cpcmener: -0.02812877 hartree
kineticenergy: 960.98190345 hartree
xcener: -95.133569990635 hartree
chargesum: 0.0000000
charge: -0.293172 -0.471098 -0.450698 0.140595 -0.005199 -0.097390 -0.281030 -0.283136 -0.298969 0.368091 -0.014143 0.257511 -0.229029 -0.235855 -0.145659 -0.070934 -0.052443 0.304205 -0.250048 -0.101992 -0.178190 -0.283956 0.102962 0.094647 0.092431 0.095507 0.099112 0.097569 0.098171 0.092539 0.120649 0.103931 0.093778 0.089087 0.096372 0.080145 0.101210 0.101681 0.102408 0.103055 0.093817 0.112882 0.114084 0.103034 0.097920 0.143151 0.129776 0.112620
qa: -0.2932 -0.4711 -0.4507 0.1406 -0.0052 -0.0974 -0.2810 -0.2831 -0.2990 0.3681 -0.0141 0.2575 -0.2290 -0.2359 -0.1457 -0.0709 -0.0524 0.3042 -0.2500 -0.1020 -0.1782 -0.2840 0.1030 0.0946 0.0924 0.0955 0.0991 0.0976 0.0982 0.0925 0.1206 0.1039 0.0938 0.0891 0.0964 0.0801 0.1012 0.1017 0.1024 0.1031 0.0938 0.1129 0.1141 0.1030 0.0979 0.1432 0.1298 0.1126
va: 2.1188 2.0383 2.0538 3.7042 3.8083 3.8267 3.8967 3.9064 3.8918 4.1562 3.7137 3.7532 3.9328 3.9342 3.8962 3.7907 3.4266 4.0617 3.9452 3.8574 3.7943 3.9444 1.0259 1.0291 1.0184 1.0012 0.9988 1.0031 1.0006 1.0028 1.0045 1.0166 0.9965 1.0063 0.9964 1.0118 0.9981 1.0004 1.0245 1.0236 1.0066 1.0090 0.9964 1.0042 1.0237 1.0041 1.0038 1.0091
dispcorr: -0.022877245 hartree
energy: -965.451866416342
dipole: -14.75565 13.80107 -0.95458 -8.32016 6.29436 -2.02580 -7.64881 6.51353 -1.13528
magnitude: 2.51077 au
magnitude: 6.38186 debye
