program: Orca
programVersion: 5.0.2
elementType: O O O C C C C C C C C C C C C C C C C C C C H H H H H H H H H H H H H H H H H H H H H H H H H H
charge: 0
multiplicity: 1
keywords: wb97x-d3
keywords: def2-TZVPP
keywords: def2/J RIJCOSX
keywords: DEFGRID2
keywords: scfconv7
keywords: smallprint printgap noloewdin
keywords: NOSOSCF
formula: C19H26O3
InChI: InChI=1/C19H26O3/c1-7-8-13-12(4)16(10-15(13)20)22-18(21)17-14(9-11(2)3)19(17,5)6/h7,9,14,16-17H,1,8,10H2,2-6H3
48 atoms
O  0.36343 -0.391205 0.520146
O  -0.998794 0.508839 2.043767
O  3.690338 2.705437 -0.084318
C  -2.927487 -1.701908 0.754583
C  -3.346826 -0.306254 0.441911
C  -1.910228 -0.714399 0.198298
C  -2.85013 -2.136012 2.19677
C  -3.318165 -2.815426 -0.186524
C  -4.240874 0.032474 -0.696366
C  -0.842975 -0.134062 1.032448
C  -4.161699 1.153265 -1.418143
C  1.498771 0.175932 1.18186
C  -5.127923 1.440811 -2.526014
C  -3.119063 2.205281 -1.194942
C  1.715173 1.648214 0.84931
C  2.717324 -0.530659 0.652259
C  3.625959 0.328689 0.166712
C  3.105378 1.699144 0.255266
C  2.812663 -2.008406 0.718202
C  4.955481 0.01431 -0.427654
C  4.90853 -0.424769 -1.863498
C  3.82115 -0.62691 -2.597022
H  -3.469288 0.324954 1.319474
H  -1.620736 -0.896055 -0.831092
H  -2.622941 -1.317455 2.877043
H  -3.807564 -2.558804 2.507334
H  -2.091576 -2.909279 2.334606
H  -4.308332 -3.202651 0.063059
H  -3.340391 -2.495212 -1.228489
H  -2.61309 -3.64562 -0.113062
H  -5.034796 -0.674063 -0.922797
H  1.415283 0.008693 2.25946
H  -5.854011 0.638953 -2.659873
H  -5.679591 2.36504 -2.333959
H  -4.605829 1.586564 -3.475447
H  -3.583595 3.184727 -1.053837
H  -2.486205 2.011664 -0.330459
H  -2.470378 2.297678 -2.070611
H  1.645097 2.300111 1.720829
H  0.992348 2.010881 0.113909
H  2.523682 -2.373276 1.706103
H  3.816298 -2.36705 0.495795
H  2.129395 -2.470735 0.00185
H  5.607716 0.889393 -0.351869
H  5.455883 -0.766467 0.154107
H  5.882542 -0.593247 -2.313379
H  3.902463 -0.950632 -3.627013
H  2.818129 -0.474353 -2.216363
elementType: O C H
totalener: -965.42919196 hartree
nucrepener: 1812.00470811 hartree
electener: -2777.43390006 hartree
oneelecener: -4910.19717455 hartree
twoeener: 2132.76327448 hartree
cpcmener: -0.02900602 hartree
kineticenergy: 960.98709158 hartree
xcener: -95.136004418277 hartree
chargesum: -0.0000000
charge: -0.296769 -0.470649 -0.445545 0.148541 -0.026445 -0.088461 -0.271607 -0.288458 -0.292500 0.371496 -0.013045 0.264863 -0.227822 -0.239822 -0.152349 -0.055444 -0.086410 0.308821 -0.267489 -0.068561 -0.186278 -0.272919 0.101692 0.094621 0.091301 0.096441 0.098110 0.099434 0.092574 0.098030 0.121255 0.106512 0.088759 0.095527 0.093954 0.099873 0.078005 0.099338 0.103525 0.102577 0.118859 0.102901 0.112077 0.090759 0.102954 0.130652 0.129888 0.107233
qa: -0.2968 -0.4706 -0.4455 0.1485 -0.0264 -0.0885 -0.2716 -0.2885 -0.2925 0.3715 -0.0130 0.2649 -0.2278 -0.2398 -0.1523 -0.0554 -0.0864 0.3088 -0.2675 -0.0686 -0.1863 -0.2729 0.1017 0.0946 0.0913 0.0964 0.0981 0.0994 0.0926 0.0980 0.1213 0.1065 0.0888 0.0955 0.0940 0.0999 0.0780 0.0993 0.1035 0.1026 0.1189 0.1029 0.1121 0.0908 0.1030 0.1307 0.1299 0.1072
va: 2.1213 2.0323 2.0636 3.7136 3.8181 3.8096 3.8915 3.9075 3.8877 4.1588 3.7079 3.7340 3.9315 3.9368 3.8988 3.7246 3.4532 4.0545 3.9519 3.8248 3.8460 3.9003 1.0294 1.0290 1.0165 1.0014 0.9999 0.9996 1.0017 1.0032 1.0039 1.0195 1.0065 0.9964 0.9963 1.0005 1.0176 0.9981 1.0241 1.0240 0.9996 1.0024 1.0000 1.0218 0.9994 1.0024 1.0049 1.0209
dispcorr: -0.023275526 hartree
energy: -965.452467481039
dipole: -16.20500 15.59662 -0.60838 -9.61934 7.35689 -2.26244 -7.61104 7.38763 -0.22341
magnitude: 2.35344 au
magnitude: 5.98198 debye
