program: Orca
programVersion: 5.0.2
elementType: O O O C C C C C C C C C C C C C C C C C C C H H H H H H H H H H H H H H H H H H H H H H H H H H
charge: 0
multiplicity: 1
keywords: wb97x-d3
keywords: def2-TZVPP
keywords: def2/J RIJCOSX
keywords: DEFGRID2
keywords: scfconv7
keywords: smallprint printgap noloewdin
keywords: NOSOSCF
formula: C19H26O3
InChI: InChI=1/C19H26O3/c1-7-8-13-12(4)16(10-15(13)20)22-18(21)17-14(9-11(2)3)19(17,5)6/h7,9,14,16-17H,1,8,10H2,2-6H3
48 atoms
O  0.555248 -0.391794 0.449618
O  -0.833232 0.56204 1.914301
O  3.921767 2.66987 -0.10923
C  -2.842139 -1.53725 0.673806
C  -3.123462 -0.159494 0.157307
C  -1.709955 -0.71018 0.086365
C  -2.92816 -1.779537 2.160198
C  -3.259646 -2.740166 -0.138371
C  -3.874194 0.098792 -1.085069
C  -0.657824 -0.109804 0.925031
C  -4.784034 1.064837 -1.2491
C  1.683908 0.168474 1.128881
C  -5.516342 1.222667 -2.546345
C  -5.171113 2.034373 -0.165495
C  1.922256 1.636433 0.796079
C  2.903836 -0.553196 0.621803
C  3.827995 0.294896 0.145963
C  3.320436 1.6705 0.222813
C  2.984566 -2.030761 0.700223
C  5.160378 -0.037366 -0.430387
C  5.12444 -0.475459 -1.865972
C  4.043475 -0.670852 -2.611032
H  -3.264456 0.576985 0.94172
H  -1.37184 -1.04167 -0.889268
H  -2.734146 -0.890463 2.756022
H  -3.931708 -2.127118 2.413429
H  -2.2262 -2.555487 2.472806
H  -2.688269 -3.619581 0.165341
H  -4.316852 -2.962207 0.022273
H  -3.107563 -2.607568 -1.208741
H  -3.668545 -0.557324 -1.925511
H  1.579886 0.004341 2.205307
H  -5.330335 2.206643 -2.985589
H  -5.229913 0.467568 -3.278673
H  -6.597702 1.153959 -2.397478
H  -5.877447 1.58408 0.537684
H  -4.317369 2.383573 0.417101
H  -5.65955 2.91565 -0.583695
H  1.84498 2.291208 1.664724
H  1.21617 2.007103 0.048753
H  3.987392 -2.400055 0.492832
H  2.305198 -2.494173 -0.018642
H  2.681684 -2.382572 1.688654
H  5.823939 0.828526 -0.347368
H  5.643068 -0.82395 0.158657
H  6.10078 -0.648316 -2.308912
H  4.134797 -0.993192 -3.640575
H  3.036987 -0.515459 -2.24098
elementType: O C H
totalener: -965.42981435 hartree
nucrepener: 1786.11665063 hartree
electener: -2751.54646498 hartree
oneelecener: -4858.49784677 hartree
twoeener: 2106.95138179 hartree
cpcmener: -0.03005052 hartree
kineticenergy: 960.99124927 hartree
xcener: -95.137588215098 hartree
chargesum: 0.0000000
charge: -0.296808 -0.473568 -0.445947 0.096835 0.042804 -0.085617 -0.272494 -0.275724 -0.290667 0.387176 -0.019698 0.266866 -0.218653 -0.283397 -0.154411 -0.055176 -0.087769 0.310024 -0.266400 -0.068064 -0.186234 -0.272989 0.090950 0.087801 0.091387 0.096707 0.097579 0.097042 0.098261 0.088692 0.115006 0.106578 0.093751 0.084185 0.097454 0.108527 0.099418 0.094822 0.103309 0.103351 0.102818 0.112044 0.118662 0.090851 0.102937 0.130680 0.129875 0.107226
qa: -0.2968 -0.4736 -0.4459 0.0968 0.0428 -0.0856 -0.2725 -0.2757 -0.2907 0.3872 -0.0197 0.2669 -0.2187 -0.2834 -0.1544 -0.0552 -0.0878 0.3100 -0.2664 -0.0681 -0.1862 -0.2730 0.0909 0.0878 0.0914 0.0967 0.0976 0.0970 0.0983 0.0887 0.1150 0.1066 0.0938 0.0842 0.0975 0.1085 0.0994 0.0948 0.1033 0.1034 0.1028 0.1120 0.1187 0.0909 0.1029 0.1307 0.1299 0.1072
va: 2.1260 2.0356 2.0632 3.7085 3.7786 3.8601 3.9043 3.9154 3.9015 4.1680 3.7193 3.7326 3.9229 3.9385 3.8991 3.7264 3.4556 4.0521 3.9527 3.8251 3.8459 3.9003 1.0291 1.0338 1.0194 1.0001 0.9995 1.0018 1.0011 1.0068 1.0116 1.0189 0.9944 1.0102 0.9931 0.9932 1.0015 1.0019 1.0240 1.0240 1.0024 1.0000 0.9995 1.0217 0.9996 1.0024 1.0049 1.0210
dispcorr: -0.022180014 hartree
energy: -965.451994367773
dipole: -20.66618 19.84327 -0.82291 -9.83173 7.47984 -2.35189 -5.48444 5.44389 -0.04055
magnitude: 2.49203 au
magnitude: 6.33424 debye
