program: Orca
programVersion: 5.0.2
elementType: O O O C C C C C C C C C C C C C C C C C C C H H H H H H H H H H H H H H H H H H H H H H H H H H
charge: 0
multiplicity: 1
keywords: wb97x-d3
keywords: def2-TZVPP
keywords: def2/J RIJCOSX
keywords: DEFGRID2
keywords: scfconv7
keywords: smallprint printgap noloewdin
keywords: NOSOSCF
formula: C19H26O3
InChI: InChI=1/C19H26O3/c1-7-8-13-12(4)16(10-15(13)20)22-18(21)17-14(9-11(2)3)19(17,5)6/h7,9,14,16-17H,1,8,10H2,2-6H3
48 atoms
O  -0.008277 1.518853 -0.632174
O  0.195837 -0.700594 -0.455376
O  4.466236 0.121249 -1.193897
C  -2.573165 -0.667489 -1.940978
C  -2.773847 -0.913407 -0.486843
C  -1.936815 0.275302 -0.927164
C  -1.719253 -1.621934 -2.738748
C  -3.70078 -0.070289 -2.748483
C  -4.074649 -0.691026 0.195951
C  -0.491123 0.273827 -0.65313
C  -4.209615 -0.333442 1.475823
C  1.383142 1.732232 -0.391612
C  -5.558742 -0.152159 2.10104
C  -3.047447 -0.077444 2.384542
C  2.327849 1.230489 -1.47804
C  1.897327 1.127862 0.892068
C  3.086934 0.532766 0.712105
C  3.441618 0.556732 -0.711415
C  1.13725 1.292273 2.154039
C  3.955162 -0.1570 1.714182
C  3.720933 -1.639216 1.665601
C  4.609549 -2.532843 1.250127
H  -2.177309 -1.729761 -0.0859
H  -2.410236 1.247717 -0.852462
H  -2.352095 -2.392036 -3.184881
H  -1.20873 -1.105364 -3.554309
H  -0.967069 -2.1298 -2.139419
H  -4.279203 0.664662 -2.188454
H  -3.311701 0.427708 -3.638557
H  -4.38812 -0.850016 -3.083837
H  -4.973247 -0.860606 -0.390868
H  1.447551 2.819483 -0.305967
H  -5.68928 -0.820056 2.956604
H  -5.678891 0.864839 2.484339
H  -6.369098 -0.344367 1.397806
H  -3.064528 0.951769 2.753226
H  -3.099098 -0.719395 3.267773
H  -2.082245 -0.245477 1.909607
H  2.720337 2.037105 -2.09856
H  1.859859 0.510058 -2.151442
H  0.754405 2.308948 2.252257
H  1.741397 1.065702 3.030434
H  0.271694 0.626307 2.176532
H  5.005546 0.061977 1.508731
H  3.741543 0.217715 2.718093
H  2.733761 -1.971039 1.974813
H  4.375709 -3.589664 1.223221
H  5.602231 -2.245386 0.923249
elementType: O C H
totalener: -965.42521033 hartree
nucrepener: 1845.46295631 hartree
electener: -2810.88816664 hartree
oneelecener: -4977.68431231 hartree
twoeener: 2166.79614567 hartree
cpcmener: -0.03148411 hartree
kineticenergy: 961.00596920 hartree
xcener: -95.141433481400 hartree
chargesum: 0.0000000
charge: -0.295660 -0.470007 -0.451899 0.152748 -0.025277 -0.113661 -0.279761 -0.289761 -0.293146 0.381948 -0.013385 0.295041 -0.230703 -0.225498 -0.154001 -0.004525 -0.122300 0.274014 -0.270678 -0.102121 -0.176086 -0.275427 0.104782 0.088552 0.095813 0.098169 0.094357 0.092265 0.097385 0.099255 0.122447 0.116131 0.095550 0.094689 0.089699 0.099252 0.101625 0.064883 0.108124 0.111960 0.115312 0.108463 0.114880 0.092945 0.107476 0.137657 0.127636 0.110839
qa: -0.2957 -0.4700 -0.4519 0.1527 -0.0253 -0.1137 -0.2798 -0.2898 -0.2931 0.3819 -0.0134 0.2950 -0.2307 -0.2255 -0.1540 -0.0045 -0.1223 0.2740 -0.2707 -0.1021 -0.1761 -0.2754 0.1048 0.0886 0.0958 0.0982 0.0944 0.0923 0.0974 0.0993 0.1224 0.1161 0.0956 0.0947 0.0897 0.0993 0.1016 0.0649 0.1081 0.1120 0.1153 0.1085 0.1149 0.0929 0.1075 0.1377 0.1276 0.1108
va: 2.1312 2.0353 2.0497 3.7033 3.8142 3.8201 3.8904 3.9100 3.8879 4.1680 3.7146 3.7657 3.9304 3.9324 3.8700 3.6745 3.4539 4.0931 3.9458 3.8707 3.7824 3.9506 1.0260 1.0353 1.0012 0.9995 1.0192 1.0019 1.0032 0.9992 1.0036 0.9903 0.9961 0.9963 1.0062 0.9980 1.0008 1.0169 1.0233 1.0257 0.9998 1.0048 0.9946 1.0202 1.0092 1.0031 1.0033 1.0136
dispcorr: -0.024298402 hartree
energy: -965.449508736045
dipole: -20.22909 17.79464 -2.43445 -3.87405 5.45500 1.58095 6.43251 -5.37030 1.06221
magnitude: 3.09100 au
magnitude: 7.85669 debye
