program: Orca
programVersion: 5.0.2
elementType: O O O C C C C C C C C C C C C C C C C C C C H H H H H H H H H H H H H H H H H H H H H H H H H H
charge: 0
multiplicity: 1
keywords: wb97x-d3
keywords: def2-TZVPP
keywords: def2/J RIJCOSX
keywords: DEFGRID2
keywords: scfconv7
keywords: smallprint printgap noloewdin
keywords: NOSOSCF
formula: C19H26O3
InChI: InChI=1/C19H26O3/c1-7-8-13-12(4)16(10-15(13)20)22-18(21)17-14(9-11(2)3)19(17,5)6/h7,9,14,16-17H,1,8,10H2,2-6H3
48 atoms
O  0.005562 1.516497 -0.656782
O  0.193338 -0.704687 -0.475648
O  4.453483 0.040702 -1.188006
C  -2.584861 -0.64768 -1.946862
C  -2.784052 -0.888419 -0.491807
C  -1.934044 0.28976 -0.937729
C  -1.7468 -1.617167 -2.743285
C  -3.704663 -0.035118 -2.753359
C  -4.079824 -0.654388 0.195697
C  -0.486759 0.274742 -0.671124
C  -4.209519 -0.354906 1.490975
C  1.398617 1.723132 -0.418912
C  -5.555799 -0.174289 2.122488
C  -3.043985 -0.174187 2.413532
C  2.34294 1.196063 -1.494448
C  1.904478 1.13742 0.876786
C  3.085571 0.522024 0.709992
C  3.440236 0.509998 -0.714064
C  1.144987 1.339397 2.133994
C  3.949287 -0.151096 1.727677
C  3.719797 -1.635076 1.706044
C  4.612593 -2.532484 1.308502
H  -2.194608 -1.710243 -0.092217
H  -2.395441 1.268041 -0.863987
H  -1.222093 -1.111018 -3.556149
H  -1.008526 -2.141569 -2.141435
H  -2.39367 -2.372983 -3.192729
H  -3.308459 0.456269 -3.643779
H  -4.404335 -0.80387 -3.087727
H  -4.271008 0.709152 -2.19353
H  -4.980492 -0.767771 -0.401249
H  1.470239 2.811284 -0.351496
H  -5.706271 -0.888827 2.936058
H  -5.65162 0.8205 2.565613
H  -6.367911 -0.304037 1.407135
H  -3.054301 0.824554 2.857721
H  -3.097082 -0.879655 3.246837
H  -2.080328 -0.311398 1.925504
H  2.757126 1.993993 -2.112526
H  1.868942 0.482712 -2.170718
H  0.785072 2.36623 2.214097
H  1.740103 1.112969 3.016888
H  0.262721 0.694915 2.164226
H  5.000292 0.066868 1.523363
H  3.730152 0.24103 2.723635
H  2.733701 -1.963761 2.021859
H  4.383984 -3.590806 1.304082
H  5.605017 -2.247676 0.978645
elementType: O C H
totalener: -965.42532946 hartree
nucrepener: 1843.58018856 hartree
electener: -2809.00551802 hartree
oneelecener: -4973.94692961 hartree
twoeener: 2164.94141159 hartree
cpcmener: -0.03164124 hartree
kineticenergy: 961.00267675 hartree
xcener: -95.140603143974 hartree
chargesum: -0.0000000
charge: -0.295367 -0.470051 -0.451209 0.154585 -0.031182 -0.108279 -0.278145 -0.291053 -0.288809 0.380101 -0.012273 0.292426 -0.230563 -0.230224 -0.152474 -0.005426 -0.121056 0.273004 -0.267646 -0.104325 -0.175127 -0.275937 0.104568 0.088000 0.098278 0.094051 0.095688 0.097602 0.099389 0.091728 0.122419 0.115981 0.095644 0.094654 0.089470 0.098278 0.101612 0.066950 0.108833 0.111857 0.114562 0.107278 0.114211 0.094146 0.107530 0.137950 0.127539 0.110811
qa: -0.2954 -0.4701 -0.4512 0.1546 -0.0312 -0.1083 -0.2781 -0.2911 -0.2888 0.3801 -0.0123 0.2924 -0.2306 -0.2302 -0.1525 -0.0054 -0.1211 0.2730 -0.2676 -0.1043 -0.1751 -0.2759 0.1046 0.0880 0.0983 0.0941 0.0957 0.0976 0.0994 0.0917 0.1224 0.1160 0.0956 0.0947 0.0895 0.0983 0.1016 0.0670 0.1088 0.1119 0.1146 0.1073 0.1142 0.0941 0.1075 0.1380 0.1275 0.1108
va: 2.1306 2.0359 2.0505 3.7044 3.8202 3.8171 3.8891 3.9117 3.8859 4.1703 3.7108 3.7696 3.9298 3.9357 3.8672 3.6745 3.4513 4.0942 3.9473 3.8717 3.7813 3.9517 1.0254 1.0357 0.9996 1.0191 1.0013 1.0030 0.9992 1.0018 1.0035 0.9902 0.9957 0.9965 1.0064 0.9981 1.0003 1.0161 1.0228 1.0261 0.9998 1.0050 0.9950 1.0192 1.0091 1.0028 1.0034 1.0137
dispcorr: -0.024180262 hartree
energy: -965.449509722118
dipole: -20.22303 17.82212 -2.40090 -3.76597 5.39994 1.63397 6.58949 -5.53677 1.05272
magnitude: 3.08908 au
magnitude: 7.85183 debye
