program: Orca
programVersion: 5.0.2
elementType: O O O C C C C C C C C C C C C C C C C C C C H H H H H H H H H H H H H H H H H H H H H H H H H H
charge: 0
multiplicity: 1
keywords: wb97x-d3
keywords: def2-TZVPP
keywords: def2/J RIJCOSX
keywords: DEFGRID2
keywords: scfconv7
keywords: smallprint printgap noloewdin
keywords: NOSOSCF
formula: C19H26O3
InChI: InChI=1/C19H26O3/c1-7-8-13-12(4)16(10-15(13)20)22-18(21)17-14(9-11(2)3)19(17,5)6/h7,9,14,16-17H,1,8,10H2,2-6H3
48 atoms
O  -0.006242 1.541748 -0.623868
O  0.210158 -0.679872 -0.491217
O  4.458735 0.134571 -1.198941
C  -2.571551 -0.641298 -1.949195
C  -2.759998 -0.900132 -0.495922
C  -1.930129 0.295294 -0.933597
C  -1.71848 -1.584527 -2.761154
C  -3.708237 -0.043381 -2.743166
C  -4.054602 -0.685166 0.200489
C  -0.482777 0.294104 -0.667269
C  -4.176919 -0.352567 1.488276
C  1.384146 1.756442 -0.37713
C  -5.519531 -0.179127 2.129671
C  -3.00531 -0.121039 2.392004
C  2.333286 1.273421 -1.46893
C  1.89473 1.131554 0.897715
C  3.084054 0.537807 0.712508
C  3.44153 0.579262 -0.709855
C  1.127769 1.263145 2.160449
C  3.943875 -0.171694 1.708552
C  3.662349 -1.646521 1.673815
C  4.515552 -2.569113 1.248386
H  -2.157016 -1.716877 -0.105729
H  -2.403395 1.266518 -0.844282
H  -2.349212 -2.352853 -3.212104
H  -1.214283 -1.057087 -3.573383
H  -0.961397 -2.09401 -2.170201
H  -3.329226 0.45706 -3.636201
H  -4.397892 -0.823302 -3.073065
H  -4.28192 0.689481 -2.175645
H  -4.958109 -0.838157 -0.383354
H  1.444611 2.842357 -0.274044
H  -5.64562 -0.866564 2.970283
H  -5.63063 0.829059 2.537798
H  -6.336996 -0.350741 1.429391
H  -2.044753 -0.260956 1.89866
H  -3.027234 0.89263 2.801422
H  -3.039771 -0.798431 3.249483
H  2.7336 2.091132 -2.069265
H  1.86546 0.569881 -2.159246
H  1.747133 1.082753 3.03648
H  0.309579 0.539675 2.192085
H  0.678121 2.252076 2.252575
H  4.997609 0.013318 1.488013
H  3.753803 0.216191 2.712183
H  2.67044 -1.942811 2.003643
H  4.248282 -3.618256 1.232205
H  5.510376 -2.315035 0.901357
elementType: O C H
totalener: -965.42509661 hartree
nucrepener: 1847.30553662 hartree
electener: -2812.73063323 hartree
oneelecener: -4981.37022153 hartree
twoeener: 2168.63958830 hartree
cpcmener: -0.03141142 hartree
kineticenergy: 961.00657050 hartree
xcener: -95.141418937764 hartree
chargesum: -0.0000000
charge: -0.296116 -0.469278 -0.451485 0.152634 -0.025936 -0.111730 -0.279988 -0.290012 -0.292060 0.382541 -0.015039 0.295360 -0.230752 -0.221558 -0.154307 -0.002433 -0.122448 0.273079 -0.277785 -0.102543 -0.176937 -0.274937 0.104776 0.088270 0.095649 0.098247 0.094508 0.097298 0.099412 0.092202 0.122430 0.115990 0.095560 0.094759 0.089694 0.061523 0.098485 0.101978 0.108545 0.111663 0.111275 0.116558 0.116252 0.091987 0.108222 0.137654 0.127502 0.111290
qa: -0.2961 -0.4693 -0.4515 0.1526 -0.0259 -0.1117 -0.2800 -0.2900 -0.2921 0.3825 -0.0150 0.2954 -0.2308 -0.2216 -0.1543 -0.0024 -0.1224 0.2731 -0.2778 -0.1025 -0.1769 -0.2749 0.1048 0.0883 0.0956 0.0982 0.0945 0.0973 0.0994 0.0922 0.1224 0.1160 0.0956 0.0948 0.0897 0.0615 0.0985 0.1020 0.1085 0.1117 0.1113 0.1166 0.1163 0.0920 0.1082 0.1377 0.1275 0.1113
va: 2.1306 2.0362 2.0499 3.7042 3.8139 3.8187 3.8897 3.9102 3.8869 4.1655 3.7190 3.7658 3.9301 3.9330 3.8663 3.6719 3.4553 4.0922 3.9426 3.8701 3.7837 3.9497 1.0259 1.0354 1.0013 0.9995 1.0194 1.0031 0.9991 1.0019 1.0037 0.9902 0.9960 0.9964 1.0062 1.0177 0.9984 1.0006 1.0230 1.0261 1.0038 0.9933 1.0007 1.0214 1.0089 1.0029 1.0033 1.0137
dispcorr: -0.024369280 hartree
energy: -965.449465890188
dipole: -20.24479 17.81486 -2.42992 -4.09646 5.66096 1.56450 6.54746 -5.44717 1.10030
magnitude: 3.09238 au
magnitude: 7.86022 debye
