program: Orca
programVersion: 5.0.2
elementType: O O O C C C C C C C C C C C C C C C C C C C H H H H H H H H H H H H H H H H H H H H H H H H H H
charge: 0
multiplicity: 1
keywords: wb97x-d3
keywords: def2-TZVPP
keywords: def2/J RIJCOSX
keywords: DEFGRID2
keywords: scfconv7
keywords: smallprint printgap noloewdin
keywords: NOSOSCF
formula: C19H26O3
InChI: InChI=1/C19H26O3/c1-7-8-13-12(4)16(10-15(13)20)22-18(21)17-14(9-11(2)3)19(17,5)6/h7,9,14,16-17H,1,8,10H2,2-6H3
48 atoms
O  0.327243 -0.477035 0.566235
O  -0.961388 0.39846 2.166351
O  3.549202 2.757328 -0.089109
C  -3.075793 -1.639163 0.945256
C  -3.353767 -0.242011 0.511837
C  -1.95434 -0.800818 0.345795
C  -3.088684 -1.958574 2.419636
C  -3.542677 -2.783525 0.078747
C  -4.166717 0.089536 -0.687104
C  -0.854005 -0.233445 1.141652
C  -3.891269 1.086474 -1.531411
C  1.485272 0.116645 1.157807
C  -4.762856 1.378454 -2.713716
C  -2.692772 1.975149 -1.384391
C  1.629318 1.601466 0.84103
C  2.694984 -0.534214 0.542204
C  3.559206 0.370363 0.056957
C  3.00179 1.719728 0.217534
C  2.8459 -2.008567 0.558788
C  4.889136 0.123654 -0.569714
C  4.847888 -0.281434 -2.0149
C  3.765852 -0.527641 -2.74257
H  -3.438886 0.466016 1.333873
H  -1.669592 -1.08347 -0.661422
H  -4.091842 -2.269958 2.717812
H  -2.408384 -2.779795 2.653241
H  -2.816087 -1.108805 3.042034
H  -3.484744 -2.552237 -0.985056
H  -2.933389 -3.671883 0.256126
H  -4.578164 -3.045145 0.306586
H  -5.055758 -0.511046 -0.860184
H  1.481818 -0.068345 2.236131
H  -4.188826 1.335756 -3.64331
H  -5.594127 0.678496 -2.798141
H  -5.177027 2.388441 -2.654555
H  -2.957495 3.017596 -1.574882
H  -2.238108 1.925421 -0.396443
H  -1.923448 1.712889 -2.116773
H  1.542758 2.243133 1.717987
H  0.878991 1.93288 0.118554
H  2.756928 -2.393134 1.577675
H  3.802094 -2.329939 0.150708
H  2.055768 -2.485639 -0.024789
H  5.505083 1.023069 -0.478478
H  5.429439 -0.648927 -0.013839
H  5.825145 -0.384863 -2.477356
H  3.854546 -0.822455 -3.780639
H  2.760354 -0.442251 -2.347858
elementType: O C H
totalener: -965.42901125 hartree
nucrepener: 1817.07177999 hartree
electener: -2782.50079124 hartree
oneelecener: -4920.30701044 hartree
twoeener: 2137.80621920 hartree
cpcmener: -0.02875617 hartree
kineticenergy: 960.99147873 hartree
xcener: -95.137291600546 hartree
chargesum: -0.0000000
charge: -0.299056 -0.471086 -0.445925 0.143507 -0.012626 -0.081776 -0.274675 -0.283144 -0.307988 0.361323 -0.001341 0.270730 -0.228004 -0.247135 -0.150571 -0.066344 -0.079669 0.307567 -0.256832 -0.069736 -0.186327 -0.275237 0.102054 0.091854 0.095400 0.097950 0.091090 0.092666 0.097236 0.098412 0.121327 0.105248 0.094547 0.088403 0.096044 0.101294 0.081647 0.103744 0.103254 0.101704 0.118663 0.098149 0.111217 0.090962 0.101937 0.130524 0.130093 0.108921
qa: -0.2991 -0.4711 -0.4459 0.1435 -0.0126 -0.0818 -0.2747 -0.2831 -0.3080 0.3613 -0.0013 0.2707 -0.2280 -0.2471 -0.1506 -0.0663 -0.0797 0.3076 -0.2568 -0.0697 -0.1863 -0.2752 0.1021 0.0919 0.0954 0.0979 0.0911 0.0927 0.0972 0.0984 0.1213 0.1052 0.0945 0.0884 0.0960 0.1013 0.0816 0.1037 0.1033 0.1017 0.1187 0.0981 0.1112 0.0910 0.1019 0.1305 0.1301 0.1089
va: 2.1174 2.0333 2.0636 3.7126 3.8085 3.8082 3.8940 3.9065 3.8976 4.1651 3.6966 3.7311 3.9343 3.9400 3.8924 3.7421 3.4415 4.0558 3.9484 3.8251 3.8436 3.9031 1.0274 1.0303 1.0012 0.9997 1.0181 1.0021 1.0033 1.0003 1.0045 1.0189 0.9957 1.0064 0.9962 1.0014 1.0119 0.9968 1.0254 1.0242 0.9986 1.0038 1.0029 1.0222 0.9987 1.0024 1.0046 1.0189
dispcorr: -0.023495007 hartree
energy: -965.452506253519
dipole: -15.41594 14.85179 -0.56415 -9.41006 7.14443 -2.26563 -8.09115 7.74892 -0.34222
magnitude: 2.35976 au
magnitude: 5.99803 debye
