program: Orca
programVersion: 5.0.2
elementType: O O O C C C C C C C C C C C C C C C C C C C H H H H H H H H H H H H H H H H H H H H H H H H H H
charge: 0
multiplicity: 1
keywords: wb97x-d3
keywords: def2-TZVPP
keywords: def2/J RIJCOSX
keywords: DEFGRID2
keywords: scfconv7
keywords: smallprint printgap noloewdin
keywords: NOSOSCF
formula: C19H26O3
InChI: InChI=1/C19H26O3/c1-7-8-13-12(4)16(10-15(13)20)22-18(21)17-14(9-11(2)3)19(17,5)6/h7,9,14,16-17H,1,8,10H2,2-6H3
48 atoms
O  0.064833 -0.065145 0.870689
O  -0.166317 -2.082279 1.811311
O  4.006405 2.393645 0.588376
C  -2.974047 0.134993 1.580131
C  -2.724256 0.030875 0.103118
C  -2.102404 -0.98468 1.03714
C  -2.36304 1.29051 2.33407
C  -4.31339 -0.285414 2.134675
C  -3.75845 -0.427473 -0.849453
C  -0.652785 -1.10833 1.286081
C  -4.208649 0.248806 -1.910741
C  1.484743 -0.079183 1.039392
C  -5.238851 -0.347019 -2.822416
C  -3.749159 1.620824 -2.30059
C  2.001651 1.300901 1.414982
C  2.173592 -0.410721 -0.261434
C  3.148413 0.469544 -0.540665
C  3.180364 1.51073 0.493434
C  1.802053 -1.620899 -1.032006
C  4.133067 0.4246 -1.667428
C  5.243649 -0.543836 -1.386398
C  5.574129 -1.560469 -2.172898
H  -2.037741 0.777305 -0.28082
H  -2.580429 -1.958649 1.057298
H  -2.118671 1.007164 3.360178
H  -1.460536 1.681761 1.869221
H  -3.079963 2.112659 2.385752
H  -4.716453 -1.171585 1.645689
H  -4.233993 -0.507821 3.200841
H  -5.044445 0.517801 2.019355
H  -4.175707 -1.413365 -0.663873
H  1.75935 -0.819376 1.794282
H  -4.873233 -0.390438 -3.852113
H  -5.519848 -1.357347 -2.524699
H  -6.146017 0.262909 -2.843977
H  -4.608185 2.275974 -2.467171
H  -3.113427 2.099484 -1.557442
H  -3.1972 1.593694 -3.24439
H  2.288128 1.390599 2.462781
H  1.25499 2.072179 1.208104
H  2.385463 -1.72332 -1.944477
H  0.745366 -1.601956 -1.308539
H  1.953082 -2.519492 -0.429068
H  3.634275 0.159363 -2.601926
H  4.553042 1.424821 -1.80866
H  5.799248 -0.3777 -0.467576
H  6.388195 -2.22789 -1.919369
H  5.048495 -1.76409 -3.099257
elementType: O C H
totalener: -965.42725676 hartree
nucrepener: 1799.68988531 hartree
electener: -2765.11714207 hartree
oneelecener: -4885.07745456 hartree
twoeener: 2119.96031249 hartree
cpcmener: -0.02938442 hartree
kineticenergy: 960.98496404 hartree
xcener: -95.136024646241 hartree
chargesum: -0.0000000
charge: -0.285926 -0.463925 -0.451310 0.118487 0.072699 -0.148274 -0.277797 -0.266153 -0.308135 0.411590 -0.028586 0.218012 -0.223713 -0.259035 -0.134953 -0.040171 -0.071402 0.300032 -0.243326 -0.103166 -0.180461 -0.283264 0.095201 0.089317 0.100789 0.086662 0.095674 0.087245 0.097850 0.096181 0.117878 0.107674 0.092650 0.087888 0.094233 0.093489 0.090394 0.099339 0.096886 0.102967 0.096891 0.115009 0.117654 0.104599 0.097696 0.142560 0.129283 0.112769
qa: -0.2859 -0.4639 -0.4513 0.1185 0.0727 -0.1483 -0.2778 -0.2662 -0.3081 0.4116 -0.0286 0.2180 -0.2237 -0.2590 -0.1350 -0.0402 -0.0714 0.3000 -0.2433 -0.1032 -0.1805 -0.2833 0.0952 0.0893 0.1008 0.0867 0.0957 0.0872 0.0978 0.0962 0.1179 0.1077 0.0926 0.0879 0.0942 0.0935 0.0904 0.0993 0.0969 0.1030 0.0969 0.1150 0.1177 0.1046 0.0977 0.1426 0.1293 0.1128
va: 2.1083 2.0398 2.0514 3.6952 3.7084 3.9107 3.9157 3.9079 3.8764 4.1633 3.7324 3.7574 3.9260 3.9461 3.9219 3.7685 3.4164 4.0731 3.9357 3.8656 3.7960 3.9426 1.0275 1.0354 0.9998 1.0108 1.0011 1.0054 1.0022 1.0025 1.0102 1.0343 0.9954 1.0088 0.9965 0.9980 1.0080 0.9959 1.0248 1.0239 1.0071 1.0028 1.0023 1.0031 1.0231 1.0040 1.0038 1.0094
dispcorr: -0.022817322 hartree
energy: -965.450074084350
dipole: -19.81928 17.99299 -1.82629 -0.38012 0.10055 -0.27958 -9.33796 8.47463 -0.86333
magnitude: 2.03932 au
magnitude: 5.18354 debye
