program: Orca
programVersion: 5.0.2
elementType: O O O C C C C C C C C C C C C C C C C C C C H H H H H H H H H H H H H H H H H H H H H H H H H H
charge: 0
multiplicity: 1
keywords: wb97x-d3
keywords: def2-TZVPP
keywords: def2/J RIJCOSX
keywords: DEFGRID2
keywords: scfconv7
keywords: smallprint printgap noloewdin
keywords: NOSOSCF
formula: C19H26O3
InChI: InChI=1/C19H26O3/c1-7-8-13-12(4)16(10-15(13)20)22-18(21)17-14(9-11(2)3)19(17,5)6/h7,9,14,16-17H,1,8,10H2,2-6H3
48 atoms
O  0.030714 -0.066078 0.912497
O  -0.208972 -2.10271 1.807435
O  3.974416 2.369979 0.552982
C  -2.966068 0.225212 1.623024
C  -2.744508 0.060682 0.148744
C  -2.144762 -0.946698 1.113376
C  -2.305595 1.386676 2.325723
C  -4.307061 -0.127367 2.220863
C  -3.805749 -0.381952 -0.776375
C  -0.693117 -1.107165 1.322044
C  -4.090564 0.143513 -1.972692
C  1.452711 -0.094947 1.046353
C  -5.19885 -0.420462 -2.811208
C  -3.372671 1.302411 -2.594403
C  1.985581 1.279687 1.421132
C  2.10663 -0.417494 -0.274443
C  3.075324 0.463287 -0.572016
C  3.140026 1.493832 0.470797
C  1.709395 -1.618984 -1.04584
C  4.033257 0.424804 -1.721206
C  5.190454 -0.48222 -1.424052
C  5.520437 -1.543093 -2.149911
H  -2.02988 0.761837 -0.266263
H  -2.654583 -1.902191 1.176184
H  -1.408967 1.743058 1.824225
H  -3.00216 2.226206 2.373398
H  -2.038791 1.126223 3.352239
H  -4.751102 -1.020115 1.782217
H  -4.210837 -0.306199 3.293722
H  -5.013219 0.694735 2.085959
H  -4.404125 -1.225903 -0.444979
H  1.740172 -0.843796 1.788051
H  -4.829829 -0.736531 -3.790784
H  -5.678318 -1.279123 -2.34082
H  -5.96937 0.331672 -3.001242
H  -4.082367 2.087371 -2.868749
H  -2.61858 1.753741 -1.952088
H  -2.879311 0.997965 -3.521665
H  2.297512 1.360328 2.462326
H  1.236954 2.055313 1.238523
H  0.651968 -1.578246 -1.317662
H  1.845283 -2.521972 -0.446284
H  2.286161 -1.72994 -1.961535
H  3.527765 0.099524 -2.632388
H  4.402663 1.437182 -1.908853
H  5.775449 -0.234576 -0.542656
H  6.36337 -2.168123 -1.883125
H  4.963986 -1.828306 -3.03569
elementType: O C H
totalener: -965.42750912 hartree
nucrepener: 1804.80346427 hartree
electener: -2770.23097339 hartree
oneelecener: -4895.26953472 hartree
twoeener: 2125.03856134 hartree
cpcmener: -0.02959924 hartree
kineticenergy: 960.99271504 hartree
xcener: -95.138299919422 hartree
chargesum: 0.0000000
charge: -0.285133 -0.464546 -0.451506 0.097327 0.069419 -0.116456 -0.269798 -0.273220 -0.295523 0.403967 -0.043791 0.215645 -0.219413 -0.255093 -0.135907 -0.036247 -0.070203 0.300556 -0.243091 -0.108090 -0.178152 -0.284407 0.096090 0.088344 0.085682 0.095665 0.100247 0.087377 0.097587 0.096853 0.116526 0.107977 0.091936 0.087416 0.093650 0.094447 0.089217 0.097912 0.096852 0.103350 0.115162 0.116995 0.096538 0.103786 0.099347 0.142376 0.129465 0.112866
qa: -0.2851 -0.4645 -0.4515 0.0973 0.0694 -0.1165 -0.2698 -0.2732 -0.2955 0.4040 -0.0438 0.2156 -0.2194 -0.2551 -0.1359 -0.0362 -0.0702 0.3006 -0.2431 -0.1081 -0.1782 -0.2844 0.0961 0.0883 0.0857 0.0957 0.1002 0.0874 0.0976 0.0969 0.1165 0.1080 0.0919 0.0874 0.0936 0.0944 0.0892 0.0979 0.0969 0.1034 0.1152 0.1170 0.0965 0.1038 0.0993 0.1424 0.1295 0.1129
va: 2.1040 2.0393 2.0501 3.7040 3.7192 3.8692 3.9122 3.9143 3.8711 4.1760 3.7637 3.7591 3.9231 3.9433 3.9257 3.7671 3.4111 4.0732 3.9366 3.8725 3.7929 3.9463 1.0286 1.0333 1.0115 1.0008 0.9999 1.0069 1.0015 1.0016 1.0120 1.0334 0.9961 1.0091 0.9963 0.9976 1.0106 0.9962 1.0249 1.0237 1.0018 1.0029 1.0076 1.0033 1.0220 1.0050 1.0037 1.0093
dispcorr: -0.022838253 hartree
energy: -965.450347369074
dipole: -19.08284 17.27194 -1.81090 -0.50704 0.24217 -0.26487 -9.66834 8.81880 -0.84954
magnitude: 2.01773 au
magnitude: 5.12866 debye
