program: Orca
programVersion: 5.0.2
elementType: O O O C C C C C C C C C C C C C C C C C C C H H H H H H H H H H H H H H H H H H H H H H H H H H
charge: 0
multiplicity: 1
keywords: wb97x-d3
keywords: def2-TZVPP
keywords: def2/J RIJCOSX
keywords: DEFGRID2
keywords: scfconv7
keywords: smallprint printgap noloewdin
keywords: NOSOSCF
formula: C19H26O3
InChI: InChI=1/C19H26O3/c1-7-8-13-12(4)16(10-15(13)20)22-18(21)17-14(9-11(2)3)19(17,5)6/h7,9,14,16-17H,1,8,10H2,2-6H3
48 atoms
O  0.062857 1.460335 -0.672215
O  0.254521 -0.768324 -0.621678
O  4.640283 0.267298 -1.175055
C  -2.590234 -0.597673 -1.995938
C  -2.722487 -0.953038 -0.55663
C  -1.887679 0.253861 -0.945389
C  -1.79675 -1.501155 -2.906666
C  -3.745654 0.081226 -2.692052
C  -3.987468 -0.772741 0.20191
C  -0.430109 0.221006 -0.737413
C  -4.061808 -0.473221 1.501337
C  1.450988 1.673418 -0.420806
C  -5.380328 -0.339933 2.199468
C  -2.858296 -0.239038 2.360973
C  2.424219 1.204135 -1.497617
C  1.962811 1.068765 0.861804
C  3.196513 0.562292 0.705588
C  3.576626 0.620574 -0.709771
C  1.168376 1.14109 2.111218
C  4.099991 -0.001805 1.747742
C  3.928152 -1.469226 2.011512
C  3.016873 -2.267865 1.470817
H  -2.121952 -1.80737 -0.251572
H  -2.339491 1.224363 -0.773969
H  -1.324955 -0.933878 -3.711602
H  -1.020017 -2.05885 -2.387614
H  -2.46465 -2.230994 -3.369117
H  -4.463476 -0.65644 -3.05725
H  -4.280766 0.772607 -2.040824
H  -3.392332 0.649146 -3.554795
H  -4.912339 -0.929339 -0.346639
H  1.506819 2.760253 -0.319495
H  -5.493098 0.654776 2.639166
H  -6.2218 -0.508186 1.527378
H  -5.460828 -1.051962 3.025127
H  -2.87888 -0.888578 3.239939
H  -1.917175 -0.413987 1.842137
H  -2.84661 0.787294 2.738797
H  2.768351 2.015205 -2.140344
H  2.000691 0.435762 -2.14664
H  0.64407 2.094046 2.1995
H  1.786875 1.001226 2.996827
H  0.406527 0.356161 2.124024
H  5.140808 0.177618 1.460193
H  3.970072 0.536006 2.692125
H  4.633401 -1.88378 2.725928
H  2.974332 -3.316677 1.736307
H  2.282408 -1.919414 0.755298
elementType: O C H
totalener: -965.42538516 hartree
nucrepener: 1857.19788231 hartree
electener: -2822.62326747 hartree
oneelecener: -5001.01932092 hartree
twoeener: 2178.39605345 hartree
cpcmener: -0.02986950 hartree
kineticenergy: 960.98627534 hartree
xcener: -95.139744380022 hartree
chargesum: 0.0000000
charge: -0.294785 -0.478690 -0.451348 0.150377 -0.023132 -0.104180 -0.278547 -0.289137 -0.296045 0.388034 -0.013353 0.300160 -0.230525 -0.223813 -0.158261 -0.007569 -0.138605 0.296101 -0.278747 -0.093100 -0.182330 -0.278152 0.104463 0.089427 0.098549 0.092362 0.096080 0.098985 0.092521 0.098019 0.121975 0.118305 0.094550 0.089696 0.095814 0.101626 0.063694 0.100690 0.104069 0.113085 0.120114 0.111838 0.118147 0.090914 0.101745 0.130881 0.127379 0.110717
qa: -0.2948 -0.4787 -0.4513 0.1504 -0.0231 -0.1042 -0.2785 -0.2891 -0.2960 0.3880 -0.0134 0.3002 -0.2305 -0.2238 -0.1583 -0.0076 -0.1386 0.2961 -0.2787 -0.0931 -0.1823 -0.2782 0.1045 0.0894 0.0985 0.0924 0.0961 0.0990 0.0925 0.0980 0.1220 0.1183 0.0945 0.0897 0.0958 0.1016 0.0637 0.1007 0.1041 0.1131 0.1201 0.1118 0.1181 0.0909 0.1017 0.1309 0.1274 0.1107
va: 2.1326 2.0168 2.0540 3.7053 3.8104 3.8155 3.8920 3.9092 3.8901 4.1291 3.7141 3.7434 3.9310 3.9312 3.8666 3.6652 3.4468 4.0587 3.9370 3.8391 3.8381 3.8948 1.0259 1.0342 0.9994 1.0195 1.0012 0.9996 1.0020 1.0030 1.0037 0.9925 0.9963 1.0062 0.9962 1.0011 1.0173 0.9975 1.0258 1.0272 1.0012 1.0027 0.9922 1.0174 1.0023 1.0009 1.0056 1.0255
dispcorr: -0.025166199 hartree
energy: -965.450551357238
dipole: -21.56147 19.19580 -2.36567 -3.88864 5.40834 1.51971 7.03865 -5.86126 1.17739
magnitude: 3.04830 au
magnitude: 7.74817 debye
