program: Gaussian 09
title: 000072899
version: EM64L-G09RevD.01
frameworkgroup: C1[X(C9H7NO2)]
method: RPBEPBE
basis: SDD
operation: Freq
keyword: #pfreq=noraman
keyword: PBEPBE/SDD
title: #p freq=noraman PBEPBE/SDD
converged: YES YES YES YES
title: Mulliken charges:
elementType: O O N C C C C C C C C C H H H H H H H
charge: -0.467358 -0.230129 -0.457392 0.239094 0.284876 0.279875 -0.472200 -0.352186 -0.403106 -0.205658 -0.244145 0.082962 0.339509 0.282634 0.237981 0.244059 0.226118 0.226403 0.388662
chargesum: 0.00000
title: Mulliken charges with hydrogens summed into heavy atoms:
elementType: O O N C C C C C C C C C
charge: -0.078696 -0.230129 -0.117883 0.239094 0.284876 0.279875 -0.189565 -0.114205 -0.159047 0.020460 -0.017743 0.082962
polarizability: 1.96207173e+02 -1.74836497e+00 1.11622356e+02 4.51277643e-03 -7.62768648e-03 4.32528156e+01
1716.lowfreq: -11.4812 -0.0009 -0.0008 0.0001 2.6078 5.0895 86.3774 95.5410 137.8199
frequency: 86.3765 95.5406 137.8175 252.6719 271.0170 338.3866 362.2808 431.2455 527.6946 537.7956 558.3085 569.8152 604.5029 609.6529 617.1776 647.7934 719.2620 751.7752 761.1038 793.8963 844.2457 868.4115 881.5472 931.9524 944.0685 979.0316 1006.8822 1022.7496 1119.2969 1122.9834 1167.3494 1200.6329 1235.7988 1274.5033 1327.5244 1335.1232 1391.4191 1417.3418 1452.9544 1490.4222 1540.8209 1583.3182 1633.0609 1669.7011 3130.0734 3139.2056 3152.3411 3167.5363 3231.2604 3546.7313 3604.9829
redmass: 7.4000 6.3861 6.4727 3.8754 5.2475 7.3973 6.1182 2.8782 4.8260 1.4986 6.1294 3.2392 6.3558 2.1673 1.2234 4.9866 4.4340 1.2980 3.9517 3.9234 1.3700 1.6240 5.4163 7.8069 1.3847 1.3135 2.2819 2.7834 1.5968 1.3403 1.0943 1.5350 1.9261 1.8973 4.0845 1.8204 5.2721 2.7557 4.8795 3.2521 6.5408 5.8489 7.4606 8.8110 1.0851 1.0891 1.0960 1.1004 1.0985 1.0646 1.0809
irintensity: 0.7169 0.6963 0.2612 0.1503 0.1039 6.2695 2.2909 3.0586 22.3881 121.7082 19.3051 5.2944 4.5261 96.0112 25.0307 7.2793 38.8409 97.8591 5.2637 0.8290 32.1894 22.6701 14.2900 104.4301 6.9512 0.0072 34.1246 176.0274 0.8183 206.2055 5.1022 0.8319 11.9125 37.5487 67.5596 14.5158 59.8465 0.4161 21.5127 3.0026 65.2390 4.8670 8.4681 554.6819 0.0042 2.7242 28.5711 29.6141 0.2702 60.4003 97.2120
temp: 298.150 k
press: 1.00000 atm
elementType: 8 8 7 6 6 6 6 6 6 6 6 6 1 1 1 1 1 1 1
symmnumber: 1
zpe: 371365.0 jmol-1
zpe.correction: 0.141445 hartree
zpe.thermalcorrener: 0.150677 hartree
zpe.thermalcorrenthalpy: 0.151621 hartree
zpe.thermalcorrgfe: 0.106713 hartree
zpe.sumelectzpe: -551.547843 hartree
zpe.sumelectthermal: -551.538612 hartree
zpe.sumelectthermalent: -551.537667 hartree
zpe.sumelectthermalfe: -551.582575 hartree
dipole: 1.2657 -2.5926 0.0003
dipole: 2.8851
quadrupole: -63.5553 -61.4121 -73.2999
quadrupole: 9.0688 -0.0009 -0.0007
quadrupole: 2.5338 4.6770 -7.2108 9.0688 -0.0009 -0.0007
hfenergy: -551.6892881 hartree
pointgroup: C01 [X(C9H7N1O2)]
dipole: 0.5148804 1.0115774 -0.00013 debye
dipolederiv: -0.6933735 0.3598939 -0.0000415 0.7363561 -1.1150324 0.0000584 -0.0000899 0.0000797 -0.451118 -1.2906444 -0.2679184 0.0000802 -0.459853 -0.7564719 0.0000833 0.0000949 0.0000639 -0.3293433 -0.2795471 -0.0334811 -0.0000059 0.3085424 -0.5339396 0.0000292 -0.0000606 0.0000633 -0.2593846 0.23637 -0.1441296 0.0000273 -0.1651599 0.0020912 0.0000044 0.000017 0.0000026 0.0579184 -0.2066356 -0.0877264 0.0000242 0.0580709 -0.1660288 0.0000212 0.0000033 0.0000208 0.0074781 -1.3681126 0.1931779 0.0000278 0.3447841 0.411794 -0.0000596 0.000039 -0.0000583 0.015868 0.423208 0.1681829 -0.0000435 -0.1835054 -0.0286554 -0.0000048 0.0000168 -0.0000286 -0.2000711 0.0204579 0.12795 -0.0000237 0.061717 0.0698924 -0.0000323 -0.0000106 -0.0000325 -0.1969345 0.2934514 0.069269 -0.0000221 -0.0902805 0.1277951 -0.0000284 -0.0000059 -0.0000287 -0.1575301 -0.1117879 -0.0080355 0.0000044 0.1955166 0.1557657 -0.0000433 -0.0000225 -0.0000339 -0.1603294 -0.0870285 -0.1339778 0.0000133 -0.3353046 -0.1116323 0.0000049 0.0000304 -0.0000076 -0.1818897 2.5883459 -0.1309436 -0.0000865 -0.2134265 1.4692163 -0.0001647 -0.0000856 -0.0001591 0.2478032 0.2318239 -0.0311396 0.0000066 -0.0559513 0.2473264 0.0000095 0.0000171 0. 0.3409456 0.0802795 -0.0300217 0.0000058 -0.0420393 0.0310761 0.0000163 0.0000027 0.0000205 0.19028 0.0748457 0.0358484 -0.0000021 -0.0212832 -0.0988988 0.0000316 0.000006 0.0000288 0.1796456 0.0810724 -0.0104645 0.0000028 0.0409597 -0.0925134 0.0000263 -0.000001 0.0000251 0.1619044 -0.0754824 -0.1000446 0.0000163 -0.0986325 0.0270844 0.0000169 0.0000149 0.0000174 0.1613088 -0.1092262 0.0871472 -0.0000025 0.0861988 0.0450071 0.0000114 -0.0000008 0.0000119 0.166936 0.1919834 -0.0635866 0.0000191 -0.1667096 0.3161241 0.0000198 0.000035 0.0000148 0.4065125 unknown
polarizability: 196.2419308|0.3400382|111.5875986|-0.0046391|-0.0075515|43.2528156 unknown
InChI: InChI=1S/C9H7NO2/c11-9(12)8-5-6-3-1-2-4-7(6)10-8/h1-5,10-11H
charge 0 multiplicity 1
19 atoms
O  -3.252646 1.296133 0.000045
O  -3.62016 -1.015208 0.00037
N  -0.560192 1.038257 -0.000031
C  0.780748 0.66808 -0.000012
C  0.830645 -0.778973 0.000151
C  -1.358086 -0.120122 0.000142
C  -0.528287 -1.251199 0.000209
C  1.952635 1.460784 -0.000124
C  2.097573 -1.42838 0.000198
C  3.187766 0.787264 -0.000073
C  3.260878 -0.641864 0.000085
C  -2.815073 -0.054273 0.000217
H  -0.94668 1.980893 -0.000098
H  -0.881368 -2.28045 0.000315
H  1.906352 2.554975 -0.000245
H  2.160452 -2.521862 0.000311
H  4.116527 1.368565 -0.000157
H  4.244941 -1.122779 0.000112
H  -4.246027 1.312057 0.000086
