program: Orca
programVersion: 5.0.2
elementType: O O O C C C C C C C C C C C C C C C C C C C H H H H H H H H H H H H H H H H H H H H H H H H H H
charge: 0
multiplicity: 1
keywords: wb97x-d3
keywords: def2-TZVPP
keywords: def2/J RIJCOSX
keywords: DEFGRID2
keywords: scfconv7
keywords: smallprint printgap noloewdin
keywords: NOSOSCF
formula: C19H26O3
InChI: InChI=1/C19H26O3/c1-7-8-13-12(4)16(10-15(13)20)22-18(21)17-14(9-11(2)3)19(17,5)6/h7,9,14,16-17H,1,8,10H2,2-6H3
48 atoms
O  0.071523 -0.365079 0.748463
O  -0.164205 -2.563628 1.094672
O  3.89373 2.224606 0.906132
C  -2.91757 -0.306558 1.605634
C  -2.724286 -0.021855 0.144649
C  -2.104105 -1.263977 0.75117
C  -2.245233 0.59749 2.610365
C  -4.248081 -0.831021 2.088963
C  -3.805055 -0.178922 -0.852244
C  -0.649415 -1.475226 0.889276
C  -4.225669 0.753903 -1.712588
C  1.496401 -0.417858 0.866713
C  -5.312723 0.455072 -2.701217
C  -3.676039 2.146029 -1.792268
C  2.016818 0.832251 1.560479
C  2.138163 -0.401787 -0.499085
C  3.051873 0.575718 -0.606616
C  3.108136 1.338082 0.646533
C  1.792549 -1.427006 -1.512525
C  3.956534 0.866189 -1.754352
C  5.225217 0.062803 -1.764412
C  5.559546 -0.901918 -0.916499
H  -2.023224 0.780558 -0.05509
H  -2.613736 -2.197397 0.535693
H  -1.3577 1.092585 2.221414
H  -2.940778 1.381033 2.918523
H  -1.958507 0.045853 3.50839
H  -4.703549 -1.538864 1.39713
H  -4.13272 -1.338626 3.048772
H  -4.952525 -0.008799 2.232393
H  -4.286044 -1.152509 -0.887405
H  1.791338 -1.322387 1.403492
H  -5.657506 -0.577226 -2.638854
H  -6.17571 1.10873 -2.547813
H  -4.971088 0.632949 -3.724801
H  -4.488292 2.877367 -1.784611
H  -3.001273 2.400466 -0.976821
H  -3.136587 2.297956 -2.731603
H  2.395229 0.643785 2.565313
H  1.239967 1.597024 1.640439
H  0.730874 -1.389743 -1.767632
H  1.987041 -2.428402 -1.121802
H  2.361717 -1.305832 -2.432124
H  3.4346 0.701806 -2.701889
H  4.218928 1.92828 -1.755343
H  5.914988 0.320554 -2.562602
H  6.50259 -1.424026 -1.017599
H  4.922149 -1.211455 -0.096654
elementType: O C H
totalener: -965.42737245 hartree
nucrepener: 1811.89682723 hartree
electener: -2777.32419968 hartree
oneelecener: -4909.59131417 hartree
twoeener: 2132.26711449 hartree
cpcmener: -0.03098136 hartree
kineticenergy: 960.98069377 hartree
xcener: -95.137085772057 hartree
chargesum: -0.0000000
charge: -0.282805 -0.465772 -0.446214 0.113021 0.073178 -0.140895 -0.275664 -0.269457 -0.306917 0.409466 -0.029316 0.230397 -0.223107 -0.259644 -0.138266 -0.037405 -0.092449 0.298249 -0.244065 -0.086695 -0.185730 -0.273674 0.094099 0.088546 0.086819 0.095373 0.100753 0.087672 0.097995 0.096416 0.117939 0.106923 0.088139 0.094108 0.092450 0.093559 0.090686 0.099694 0.098899 0.102222 0.117146 0.116089 0.101156 0.102845 0.093978 0.130107 0.130138 0.110014
qa: -0.2828 -0.4658 -0.4462 0.1130 0.0732 -0.1409 -0.2757 -0.2695 -0.3069 0.4095 -0.0293 0.2304 -0.2231 -0.2596 -0.1383 -0.0374 -0.0924 0.2982 -0.2441 -0.0867 -0.1857 -0.2737 0.0941 0.0885 0.0868 0.0954 0.1008 0.0877 0.0980 0.0964 0.1179 0.1069 0.0881 0.0941 0.0925 0.0936 0.0907 0.0997 0.0989 0.1022 0.1171 0.1161 0.1012 0.1028 0.0940 0.1301 0.1301 0.1100
va: 2.1080 2.0386 2.0597 3.6934 3.7107 3.9081 3.9151 3.9108 3.8735 4.1643 3.7380 3.7500 3.9260 3.9459 3.9096 3.7462 3.4274 4.0711 3.9372 3.8449 3.8346 3.9082 1.0294 1.0353 1.0107 1.0015 0.9999 1.0057 1.0018 1.0022 1.0105 1.0354 1.0089 0.9964 0.9954 0.9984 1.0081 0.9957 1.0236 1.0259 0.9997 1.0020 1.0049 0.9994 1.0179 1.0028 1.0044 1.0152
dispcorr: -0.023294171 hartree
energy: -965.450666620170
dipole: -19.30516 17.57641 -1.72875 2.14976 -2.22766 -0.07790 -6.93311 5.99746 -0.93565
magnitude: 1.96725 au
magnitude: 5.00036 debye
