program: Orca
programVersion: 5.0.2
elementType: O O O C C C C C C C C C C C C C C C C C C C H H H H H H H H H H H H H H H H H H H H H H H H H H
charge: 0
multiplicity: 1
keywords: wb97x-d3
keywords: def2-TZVPP
keywords: def2/J RIJCOSX
keywords: DEFGRID2
keywords: scfconv7
keywords: smallprint printgap noloewdin
keywords: NOSOSCF
formula: C19H26O3
InChI: InChI=1/C19H26O3/c1-7-8-13-12(4)16(10-15(13)20)22-18(21)17-14(9-11(2)3)19(17,5)6/h7,9,14,16-17H,1,8,10H2,2-6H3
48 atoms
O  0.003121 -0.308442 0.935402
O  -0.367875 -2.442596 1.500925
O  4.130531 1.834621 0.792604
C  -2.97064 0.080346 1.704798
C  -2.768368 0.086975 0.218708
C  -2.225765 -1.066412 1.043986
C  -2.237066 1.105031 2.536265
C  -4.326579 -0.265244 2.272728
C  -3.852168 -0.185481 -0.74598
C  -0.78601 -1.350541 1.193733
C  -4.099179 0.486027 -1.87561
C  1.42275 -0.470275 0.962128
C  -5.218133 0.071684 -2.783988
C  -3.314832 1.66976 -2.35482
C  2.101333 0.748459 1.568787
C  1.964541 -0.558838 -0.4434
C  2.993589 0.283632 -0.627173
C  3.215617 1.063163 0.598038
C  1.395305 -1.533259 -1.405046
C  3.886029 0.433142 -1.816965
C  5.148876 -0.356089 -1.628281
C  6.35723 0.173636 -1.48787
H  -2.014031 0.789751 -0.115321
H  -2.797206 -1.98693 0.991186
H  -1.326199 1.471469 2.068589
H  -2.883439 1.969365 2.70216
H  -1.975695 0.701394 3.516891
H  -4.827151 -1.064795 1.728018
H  -4.233953 -0.588289 3.311668
H  -4.982242 0.607986 2.256393
H  -4.493704 -1.030913 -0.514204
H  1.682273 -1.377775 1.511862
H  -5.734821 -0.817888 -2.42364
H  -5.956831 0.870802 -2.889625
H  -4.848211 -0.140226 -3.790984
H  -3.984673 2.492524 -2.613628
H  -2.599457 2.049738 -1.629442
H  -2.76452 1.424897 -3.266517
H  2.477716 0.585131 2.578513
H  1.418809 1.601975 1.603782
H  1.42968 -2.544507 -0.993729
H  1.924805 -1.535954 -2.355614
H  0.344649 -1.312105 -1.608384
H  3.368961 0.091555 -2.716584
H  4.124453 1.488269 -1.969072
H  5.028621 -1.435184 -1.588884
H  7.231766 -0.447758 -1.341744
H  6.519037 1.245209 -1.510952
elementType: O C H
totalener: -965.42717904 hartree
nucrepener: 1804.97931415 hartree
electener: -2770.40649319 hartree
oneelecener: -4895.73613144 hartree
twoeener: 2125.32963825 hartree
cpcmener: -0.03128760 hartree
kineticenergy: 960.99499721 hartree
xcener: -95.138706792279 hartree
chargesum: -0.0000000
charge: -0.284897 -0.464308 -0.447407 0.096532 0.070390 -0.111765 -0.268901 -0.273937 -0.295809 0.398347 -0.041255 0.212281 -0.220340 -0.258789 -0.134156 -0.019333 -0.074389 0.281891 -0.245582 -0.112666 -0.175180 -0.276890 0.094351 0.087211 0.085877 0.095463 0.100632 0.087470 0.097865 0.097224 0.116648 0.108106 0.088635 0.094010 0.092063 0.094280 0.089864 0.099189 0.097269 0.103187 0.114471 0.103346 0.111189 0.108780 0.098846 0.140506 0.128028 0.111655
qa: -0.2849 -0.4643 -0.4474 0.0965 0.0704 -0.1118 -0.2689 -0.2739 -0.2958 0.3983 -0.0413 0.2123 -0.2203 -0.2588 -0.1342 -0.0193 -0.0744 0.2819 -0.2456 -0.1127 -0.1752 -0.2769 0.0944 0.0872 0.0859 0.0955 0.1006 0.0875 0.0979 0.0972 0.1166 0.1081 0.0886 0.0940 0.0921 0.0943 0.0899 0.0992 0.0973 0.1032 0.1145 0.1033 0.1112 0.1088 0.0988 0.1405 0.1280 0.1117
va: 2.1041 2.0406 2.0535 3.7095 3.7161 3.8541 3.9098 3.9139 3.8751 4.1842 3.7578 3.7678 3.9227 3.9440 3.9241 3.7420 3.4211 4.0838 3.9380 3.8732 3.7819 3.9582 1.0288 1.0340 1.0119 1.0008 0.9997 1.0067 1.0013 1.0015 1.0122 1.0345 1.0088 0.9963 0.9957 0.9981 1.0097 0.9957 1.0255 1.0241 1.0038 1.0056 0.9992 1.0049 1.0181 1.0006 1.0033 1.0132
dispcorr: -0.022811886 hartree
energy: -965.449990926502
dipole: -18.62111 16.69198 -1.92913 3.43021 -3.50630 -0.07609 -8.90836 7.92842 -0.97994
magnitude: 2.16509 au
magnitude: 5.50323 debye
