program: Orca
programVersion: 5.0.2
elementType: O O O C C C C C C C C C C C C C C C C C C C H H H H H H H H H H H H H H H H H H H H H H H H H H
charge: 0
multiplicity: 1
keywords: wb97x-d3
keywords: def2-TZVPP
keywords: def2/J RIJCOSX
keywords: DEFGRID2
keywords: scfconv7
keywords: smallprint printgap noloewdin
keywords: NOSOSCF
formula: C19H26O3
InChI: InChI=1/C19H26O3/c1-7-8-13-12(4)16(10-15(13)20)22-18(21)17-14(9-11(2)3)19(17,5)6/h7,9,14,16-17H,1,8,10H2,2-6H3
48 atoms
O  0.050327 -0.323694 0.767404
O  -0.28063 -2.454406 1.368145
O  4.078007 1.98857 0.704191
C  -2.95054 -0.04256 1.537364
C  -2.739066 0.017012 0.052337
C  -2.162068 -1.138483 0.837931
C  -2.258527 0.97389 2.412269
C  -4.30472 -0.449441 2.065083
C  -3.828888 -0.26126 -0.914035
C  -0.718184 -1.380991 1.023923
C  -4.425883 0.642013 -1.696749
C  1.47011 -0.43227 0.903151
C  -5.503079 0.239947 -2.658145
C  -4.086923 2.101126 -1.700379
C  2.059137 0.861238 1.446906
C  2.122401 -0.621938 -0.445207
C  3.127195 0.249239 -0.631369
C  3.221634 1.148795 0.526123
C  1.676536 -1.707094 -1.351896
C  4.104858 0.330297 -1.759337
C  5.365517 -0.408469 -1.414683
C  6.547139 0.163155 -1.220687
H  -2.017743 0.764321 -0.261513
H  -2.701144 -2.07626 0.751373
H  -2.932131 1.813057 2.59759
H  -1.996659 0.547421 3.38288
H  -1.353421 1.382516 1.968385
H  -4.223571 -0.822585 3.088031
H  -4.981908 0.407268 2.079211
H  -4.773556 -1.229751 1.466515
H  -4.159409 -1.294043 -0.98419
H  1.716024 -1.277537 1.550019
H  -6.442646 0.751352 -2.431938
H  -5.240678 0.518124 -3.682564
H  -5.691921 -0.833609 -2.640719
H  -3.657474 2.399864 -2.660973
H  -4.989596 2.703285 -1.567789
H  -3.385066 2.386329 -0.918191
H  2.377897 0.792419 2.486992
H  1.342026 1.683391 1.375612
H  0.628651 -1.57777 -1.632644
H  1.752038 -2.677403 -0.856257
H  2.263294 -1.74835 -2.267265
H  3.665204 -0.092165 -2.665961
H  4.33306 1.37678 -1.974053
H  5.266538 -1.485121 -1.305427
H  7.420913 -0.422774 -0.963668
H  6.687902 1.234207 -1.31205
elementType: O C H
totalener: -965.42689668 hartree
nucrepener: 1797.28446932 hartree
electener: -2762.71136600 hartree
oneelecener: -4880.44220830 hartree
twoeener: 2117.73084229 hartree
cpcmener: -0.03072122 hartree
kineticenergy: 960.98227107 hartree
xcener: -95.135140113082 hartree
chargesum: -0.0000000
charge: -0.283429 -0.464831 -0.447806 0.146473 0.044481 -0.159936 -0.290125 -0.265533 -0.302228 0.411331 -0.021277 0.219008 -0.227091 -0.256424 -0.135415 -0.022767 -0.076275 0.282629 -0.248125 -0.109365 -0.175634 -0.276382 0.099737 0.088937 0.095118 0.102893 0.087700 0.098426 0.095298 0.089393 0.118738 0.107077 0.094302 0.093124 0.088593 0.099613 0.093663 0.088755 0.097759 0.103877 0.112943 0.114530 0.102865 0.108688 0.096669 0.140271 0.128005 0.111748
qa: -0.2834 -0.4648 -0.4478 0.1465 0.0445 -0.1599 -0.2901 -0.2655 -0.3022 0.4113 -0.0213 0.2190 -0.2271 -0.2564 -0.1354 -0.0228 -0.0763 0.2826 -0.2481 -0.1094 -0.1756 -0.2764 0.0997 0.0889 0.0951 0.1029 0.0877 0.0984 0.0953 0.0894 0.1187 0.1071 0.0943 0.0931 0.0886 0.0996 0.0937 0.0888 0.0978 0.1039 0.1129 0.1145 0.1029 0.1087 0.0967 0.1403 0.1280 0.1117
va: 2.1105 2.0394 2.0535 3.6763 3.7210 3.9432 3.9153 3.9068 3.8757 4.1659 3.7070 3.7657 3.9275 3.9466 3.9190 3.7473 3.4308 4.0865 3.9401 3.8705 3.7846 3.9574 1.0225 1.0359 1.0017 0.9993 1.0100 1.0023 1.0031 1.0039 1.0088 1.0330 0.9965 0.9952 1.0083 0.9968 0.9982 1.0074 1.0248 1.0249 0.9993 1.0034 1.0057 1.0047 1.0198 1.0006 1.0032 1.0133
dispcorr: -0.022978064 hartree
energy: -965.449874745945
dipole: -19.80197 17.88766 -1.91432 3.49439 -3.64197 -0.14758 -7.05123 6.19603 -0.85520
magnitude: 2.10185 au
magnitude: 5.34247 debye
