program: Orca
programVersion: 5.0.2
elementType: O O O C C C C C C C C C C C C C C C C C C C H H H H H H H H H H H H H H H H H H H H H H H H H H
charge: 0
multiplicity: 1
keywords: wb97x-d3
keywords: def2-TZVPP
keywords: def2/J RIJCOSX
keywords: DEFGRID2
keywords: scfconv7
keywords: smallprint printgap noloewdin
keywords: NOSOSCF
formula: C19H26O3
InChI: InChI=1/C19H26O3/c1-7-8-13-12(4)16(10-15(13)20)22-18(21)17-14(9-11(2)3)19(17,5)6/h7,9,14,16-17H,1,8,10H2,2-6H3
48 atoms
O  -0.059667 -0.12556 0.789945
O  -0.526521 0.212668 2.943725
O  4.105617 1.731661 0.290506
C  -2.690621 1.592806 0.520536
C  -2.781095 0.204682 -0.046559
C  -2.280769 0.401939 1.36882
C  -1.64007 2.520889 -0.03965
C  -3.94159 2.317242 0.955093
C  -4.062307 -0.494776 -0.26249
C  -0.885613 0.16381 1.790297
C  -4.38482 -1.254013 -1.315017
C  1.317038 -0.352518 1.103465
C  -5.719352 -1.933369 -1.388558
C  -3.484158 -1.525389 -2.483625
C  2.100596 0.922157 1.391069
C  1.953541 -0.943127 -0.127233
C  3.02416 -0.237826 -0.522631
C  3.21029 0.917828 0.365781
C  1.400921 -2.185225 -0.719301
C  3.98215 -0.528538 -1.632505
C  5.204576 -1.218529 -1.100823
C  6.420266 -0.688248 -1.0685
H  -2.007149 -0.019511 -0.771062
H  -2.981189 0.165238 2.163056
H  -2.070252 3.121898 -0.843472
H  -1.276799 3.211268 0.724859
H  -0.781966 1.996877 -0.456563
H  -3.694452 3.10933 1.664849
H  -4.433224 2.783442 0.098581
H  -4.666923 1.663596 1.438262
H  -4.801754 -0.391535 0.526684
H  1.383998 -1.066051 1.930095
H  -6.288576 -1.589815 -2.256725
H  -5.603786 -3.014592 -1.506004
H  -6.323842 -1.756281 -0.498966
H  -2.632847 -0.851862 -2.551257
H  -3.094287 -2.545467 -2.44183
H  -4.036797 -1.447203 -3.421967
H  2.512427 0.948135 2.400491
H  1.492042 1.821092 1.267493
H  2.02946 -2.58494 -1.512477
H  0.405534 -2.011918 -1.134699
H  1.288196 -2.954883 0.047699
H  3.50181 -1.157466 -2.385453
H  4.264461 0.402512 -2.129051
H  5.047233 -2.216743 -0.701512
H  7.261629 -1.233881 -0.659804
H  6.621309 0.307904 -1.445371
elementType: O C H
totalener: -965.42829845 hartree
nucrepener: 1807.32371525 hartree
electener: -2772.75201370 hartree
oneelecener: -4900.46597655 hartree
twoeener: 2127.71396285 hartree
cpcmener: -0.03242574 hartree
kineticenergy: 961.00320002 hartree
xcener: -95.138467339925 hartree
chargesum: -0.0000000
charge: -0.282538 -0.463575 -0.445815 0.094822 0.081192 -0.105693 -0.276500 -0.276706 -0.295997 0.395519 -0.037408 0.217005 -0.220583 -0.266200 -0.143321 -0.043450 -0.062887 0.291662 -0.254119 -0.107939 -0.176307 -0.275022 0.087169 0.092078 0.098850 0.101909 0.085492 0.097508 0.096521 0.088006 0.116417 0.109434 0.094141 0.092373 0.086861 0.092121 0.101683 0.094474 0.107068 0.105198 0.100026 0.108633 0.112013 0.107856 0.098037 0.140004 0.128241 0.111746
qa: -0.2825 -0.4636 -0.4458 0.0948 0.0812 -0.1057 -0.2765 -0.2767 -0.2960 0.3955 -0.0374 0.2170 -0.2206 -0.2662 -0.1433 -0.0434 -0.0629 0.2917 -0.2541 -0.1079 -0.1763 -0.2750 0.0872 0.0921 0.0989 0.1019 0.0855 0.0975 0.0965 0.0880 0.1164 0.1094 0.0941 0.0924 0.0869 0.0921 0.1017 0.0945 0.1071 0.1052 0.1000 0.1086 0.1120 0.1079 0.0980 0.1400 0.1282 0.1117
va: 2.1139 2.0419 2.0576 3.7047 3.7222 3.8547 3.9028 3.9101 3.8790 4.1813 3.7469 3.7658 3.9255 3.9423 3.9022 3.7506 3.4468 4.0773 3.9600 3.8633 3.7839 3.9568 1.0224 1.0316 1.0019 0.9991 1.0159 1.0012 1.0016 1.0066 1.0117 1.0173 0.9960 0.9952 1.0095 1.0074 0.9946 0.9989 1.0237 1.0221 1.0049 0.9992 0.9977 1.0056 1.0191 1.0007 1.0030 1.0134
dispcorr: -0.023048442 hartree
energy: -965.451346896074
dipole: -17.51681 15.76846 -1.74835 -4.62247 3.07214 -1.55033 -12.69549 11.24623 -1.44926
magnitude: 2.74966 au
magnitude: 6.98907 debye
