program: Orca
programVersion: 5.0.2
elementType: O O O C C C C C C C C C C C C C C C C C C C H H H H H H H H H H H H H H H H H H H H H H H H H H
charge: 0
multiplicity: 1
keywords: wb97x-d3
keywords: def2-TZVPP
keywords: def2/J RIJCOSX
keywords: DEFGRID2
keywords: scfconv7
keywords: smallprint printgap noloewdin
keywords: NOSOSCF
formula: C19H26O3
InChI: InChI=1/C19H26O3/c1-7-8-13-12(4)16(10-15(13)20)22-18(21)17-14(9-11(2)3)19(17,5)6/h7,9,14,16-17H,1,8,10H2,2-6H3
48 atoms
O  -0.070711 0.31534 0.50602
O  -0.642785 1.152668 2.493118
O  4.288677 1.776641 -0.174301
C  -2.798373 1.857151 -0.152828
C  -2.740515 0.40953 -0.521673
C  -2.339979 0.834533 0.873297
C  -1.794274 2.800891 -0.76887
C  -4.134136 2.502574 0.123955
C  -3.956481 -0.414868 -0.746759
C  -0.952165 0.794086 1.380641
C  -3.994249 -1.747346 -0.660982
C  1.290157 0.181839 0.920637
C  -5.241058 -2.517732 -0.97068
C  -2.811109 -2.578392 -0.269538
C  2.101346 1.46864 0.838633
C  1.954161 -0.766179 -0.040456
C  3.09434 -0.26007 -0.532738
C  3.308589 1.087297 0.009843
C  1.366138 -2.102912 -0.298429
C  4.077063 -0.917043 -1.438892
C  5.128962 -1.723998 -0.734109
C  5.19792 -1.968731 0.568494
H  -1.902632 0.151553 -1.163476
H  -3.058524 0.648435 1.664941
H  -0.85864 2.311968 -1.038287
H  -2.204004 3.235735 -1.683022
H  -1.560854 3.624759 -0.09113
H  -4.833677 1.825799 0.615053
H  -4.011202 3.371728 0.773163
H  -4.598827 2.847406 -0.802362
H  -4.86149 0.108223 -1.042945
H  1.320229 -0.245319 1.927654
H  -6.069102 -1.867186 -1.25265
H  -5.072865 -3.221294 -1.790749
H  -5.558791 -3.116136 -0.112641
H  -1.954998 -1.985383 0.048221
H  -3.068615 -3.25495 0.549504
H  -2.488976 -3.212216 -1.100572
H  2.398355 1.858196 1.812454
H  1.549556 2.26014 0.324372
H  2.064149 -2.767939 -0.803644
H  0.471284 -2.021255 -0.920221
H  1.057334 -2.575908 0.635986
H  3.561078 -1.566508 -2.152383
H  4.574483 -0.158964 -2.051501
H  5.889682 -2.140804 -1.387516
H  5.997917 -2.573165 0.976839
H  4.473514 -1.584079 1.276808
elementType: O C H
totalener: -965.42609821 hartree
nucrepener: 1830.21571127 hartree
electener: -2795.64180948 hartree
oneelecener: -4946.12550418 hartree
twoeener: 2150.48369469 hartree
cpcmener: -0.03131957 hartree
kineticenergy: 960.99193225 hartree
xcener: -95.137490107912 hartree
chargesum: 0.0000000
charge: -0.279415 -0.463919 -0.444519 0.148237 -0.011562 -0.112811 -0.267382 -0.302742 -0.285611 0.397072 -0.022870 0.216462 -0.230020 -0.225777 -0.128658 -0.033938 -0.076162 0.301272 -0.282152 -0.082736 -0.186529 -0.272615 0.104718 0.096209 0.082220 0.097653 0.103064 0.090916 0.099242 0.099389 0.123415 0.106974 0.089083 0.094423 0.094786 0.056250 0.096926 0.102847 0.101336 0.104167 0.106324 0.112227 0.117277 0.101662 0.094687 0.130585 0.130987 0.109009
qa: -0.2794 -0.4639 -0.4445 0.1482 -0.0116 -0.1128 -0.2674 -0.3027 -0.2856 0.3971 -0.0229 0.2165 -0.2300 -0.2258 -0.1287 -0.0339 -0.0762 0.3013 -0.2822 -0.0827 -0.1865 -0.2726 0.1047 0.0962 0.0822 0.0977 0.1031 0.0909 0.0992 0.0994 0.1234 0.1070 0.0891 0.0944 0.0948 0.0562 0.0969 0.1028 0.1013 0.1042 0.1063 0.1122 0.1173 0.1017 0.0947 0.1306 0.1310 0.1090
va: 2.1098 2.0407 2.0608 3.7284 3.7886 3.8391 3.8808 3.9106 3.8608 4.1540 3.7188 3.7680 3.9308 3.9353 3.8960 3.6985 3.4363 4.0726 3.9525 3.8364 3.8347 3.9064 1.0188 1.0272 1.0153 1.0027 0.9999 1.0015 1.0023 0.9989 1.0029 1.0209 1.0068 0.9954 0.9968 1.0216 1.0014 0.9979 1.0265 1.0192 1.0066 0.9972 0.9963 0.9998 1.0171 1.0029 1.0042 1.0158
dispcorr: -0.024672729 hartree
energy: -965.450770939080
dipole: -17.48082 15.72233 -1.75849 -9.78377 7.94648 -1.83729 -7.07655 5.94163 -1.13492
magnitude: 2.78496 au
magnitude: 7.07879 debye
