program: Orca
programVersion: 5.0.2
elementType: O O O C C C C C C C C C C C C C C C C C C C H H H H H H H H H H H H H H H H H H H H H H H H H H
charge: 0
multiplicity: 1
keywords: wb97x-d3
keywords: def2-TZVPP
keywords: def2/J RIJCOSX
keywords: DEFGRID2
keywords: scfconv7
keywords: smallprint printgap noloewdin
keywords: NOSOSCF
formula: C19H26O3
InChI: InChI=1/C19H26O3/c1-7-8-13-12(4)16(10-15(13)20)22-18(21)17-14(9-11(2)3)19(17,5)6/h7,9,14,16-17H,1,8,10H2,2-6H3
48 atoms
O  -0.024708 -0.160019 0.833561
O  -0.382367 -2.355534 1.085316
O  4.010545 2.115037 0.828478
C  -2.967477 0.036669 1.84087
C  -2.80295 0.400699 0.404488
C  -2.250037 -0.923723 0.902628
C  -2.197445 0.810814 2.882734
C  -4.310774 -0.439906 2.338773
C  -3.926892 0.411433 -0.565064
C  -0.809146 -1.231064 0.958336
C  -3.779028 0.378095 -1.892135
C  1.396383 -0.310381 0.87694
C  -4.961212 0.427724 -2.811058
C  -2.446205 0.288244 -2.5698
C  2.035438 0.898346 1.544222
C  1.977304 -0.337472 -0.515856
C  2.9703 0.554753 -0.654953
C  3.13975 1.303974 0.595674
C  1.506382 -1.318468 -1.522753
C  3.859204 0.760699 -1.832893
C  5.031645 -0.176285 -1.893741
C  5.282252 -1.185586 -1.069347
H  -2.041479 1.153018 0.2217
H  -2.827803 -1.805124 0.646812
H  -1.269697 1.234556 2.505458
H  -2.805584 1.64154 3.245857
H  -1.956761 0.182216 3.742031
H  -4.836472 -1.059464 1.612275
H  -4.19045 -1.033565 3.247051
H  -4.954996 0.407389 2.583496
H  -4.932611 0.471601 -0.15931
H  1.656148 -1.233895 1.399874
H  -4.903173 1.288686 -3.482416
H  -4.999054 -0.45858 -3.450114
H  -5.903343 0.490204 -2.266346
H  -2.267879 1.167795 -3.194567
H  -1.612526 0.200781 -1.874497
H  -2.412535 -0.574945 -3.239887
H  2.4195 0.692393 2.543226
H  1.325954 1.725883 1.627233
H  2.057809 -1.243829 -2.457308
H  0.446839 -1.178095 -1.749101
H  1.615279 -2.336326 -1.143953
H  3.289444 0.664503 -2.761818
H  4.23594 1.787707 -1.834076
H  5.720411 0.017081 -2.710487
H  6.157821 -1.806901 -1.206177
H  4.640052 -1.434705 -0.232951
elementType: O C H
totalener: -965.42568833 hartree
nucrepener: 1834.73999483 hartree
electener: -2800.16568316 hartree
oneelecener: -4955.18631547 hartree
twoeener: 2155.02063231 hartree
cpcmener: -0.03033611 hartree
kineticenergy: 960.99546096 hartree
xcener: -95.140076926502 hartree
chargesum: -0.0000000
charge: -0.279449 -0.466016 -0.446323 0.150241 -0.002265 -0.110627 -0.266540 -0.300332 -0.300853 0.391590 -0.012266 0.229836 -0.231749 -0.226305 -0.135098 -0.046479 -0.083686 0.293524 -0.244153 -0.083584 -0.185369 -0.274072 0.101801 0.090843 0.087034 0.095973 0.100686 0.091075 0.098277 0.100796 0.123232 0.104868 0.094285 0.094583 0.088894 0.101146 0.059270 0.097149 0.098534 0.101836 0.102286 0.113263 0.118100 0.102263 0.093339 0.130372 0.130134 0.109937
qa: -0.2794 -0.4660 -0.4463 0.1502 -0.0023 -0.1106 -0.2665 -0.3003 -0.3009 0.3916 -0.0123 0.2298 -0.2317 -0.2263 -0.1351 -0.0465 -0.0837 0.2935 -0.2442 -0.0836 -0.1854 -0.2741 0.1018 0.0908 0.0870 0.0960 0.1007 0.0911 0.0983 0.1008 0.1232 0.1049 0.0943 0.0946 0.0889 0.1011 0.0593 0.0971 0.0985 0.1018 0.1023 0.1133 0.1181 0.1023 0.0933 0.1304 0.1301 0.1099
va: 2.0999 2.0379 2.0595 3.7200 3.7835 3.8516 3.8933 3.9156 3.8808 4.1558 3.7175 3.7680 3.9302 3.9402 3.9061 3.7297 3.4241 4.0772 3.9377 3.8476 3.8335 3.9084 1.0228 1.0303 1.0099 1.0018 1.0002 1.0016 1.0024 0.9982 1.0038 1.0350 0.9958 0.9964 1.0067 0.9999 1.0190 0.9988 1.0239 1.0255 1.0051 0.9978 1.0041 0.9997 1.0187 1.0029 1.0047 1.0153
dispcorr: -0.024564677 hartree
energy: -965.450253004500
dipole: -17.16874 15.43943 -1.72931 -0.71749 0.60310 -0.11439 -7.80227 6.85358 -0.94868
magnitude: 1.97575 au
magnitude: 5.02197 debye
