program: Orca
programVersion: 5.0.2
elementType: O O O C C C C C C C C C C C C C C C C C C C H H H H H H H H H H H H H H H H H H H H H H H H H H
charge: 0
multiplicity: 1
keywords: wb97x-d3
keywords: def2-TZVPP
keywords: def2/J RIJCOSX
keywords: DEFGRID2
keywords: scfconv7
keywords: smallprint printgap noloewdin
keywords: NOSOSCF
formula: C19H26O3
InChI: InChI=1/C19H26O3/c1-7-8-13-12(4)16(10-15(13)20)22-18(21)17-14(9-11(2)3)19(17,5)6/h7,9,14,16-17H,1,8,10H2,2-6H3
48 atoms
O  0.009268 -0.252877 0.936148
O  -0.316059 -2.455935 1.159127
O  3.972701 2.122744 0.86434
C  -2.93872 -0.010065 1.812254
C  -2.76048 0.219176 0.346884
C  -2.203576 -1.050113 0.982813
C  -2.19757 0.878428 2.782181
C  -4.281121 -0.452647 2.346206
C  -3.861548 0.129683 -0.635793
C  -0.758451 -1.335978 1.04457
C  -3.769971 0.436875 -1.934026
C  1.4330 -0.382745 0.935061
C  -4.963705 0.340646 -2.835392
C  -2.512222 0.894812 -2.608086
C  2.07366 0.814628 1.621243
C  1.965322 -0.352352 -0.476871
C  2.924392 0.574833 -0.6255
C  3.119346 1.290648 0.640645
C  1.486042 -1.3184 -1.494092
C  3.759055 0.845467 -1.829513
C  4.942243 -0.066615 -1.981965
C  5.246064 -1.10561 -1.214214
H  -2.000117 0.955093 0.110683
H  -2.773768 -1.955219 0.80541
H  -2.843002 1.706415 3.083161
H  -1.926597 0.331678 3.687828
H  -1.291184 1.313963 2.367727
H  -4.954662 0.400371 2.452073
H  -4.772323 -1.189059 1.711107
H  -4.163821 -0.904346 3.333163
H  -4.823139 -0.212745 -0.265632
H  1.722159 -1.318478 1.419113
H  -5.861036 0.027617 -2.301382
H  -5.175144 1.301982 -3.311821
H  -4.788345 -0.371407 -3.646509
H  -2.314225 0.289554 -3.496253
H  -2.609761 1.926588 -2.956976
H  -1.629159 0.841043 -1.973737
H  2.515281 0.574533 2.588595
H  1.348968 1.616895 1.782492
H  0.410167 -1.221436 -1.658879
H  1.662497 -2.34315 -1.159456
H  1.983431 -1.18515 -2.452922
H  3.151157 0.778871 -2.737021
H  4.118522 1.878315 -1.803274
H  5.589361 0.171172 -2.82104
H  6.124025 -1.705511 -1.417394
H  4.648522 -1.39933 -0.359444
elementType: O C H
totalener: -965.42635502 hartree
nucrepener: 1830.86536955 hartree
electener: -2796.29172457 hartree
oneelecener: -4947.41698920 hartree
twoeener: 2151.12526463 hartree
cpcmener: -0.03075339 hartree
kineticenergy: 960.98755533 hartree
xcener: -95.139157373471 hartree
chargesum: -0.0000000
charge: -0.281545 -0.466361 -0.446688 0.129183 -0.006404 -0.078977 -0.263821 -0.300533 -0.276117 0.384182 -0.015835 0.234224 -0.232613 -0.257240 -0.139142 -0.048987 -0.084573 0.298158 -0.243609 -0.083350 -0.184948 -0.274507 0.102088 0.091595 0.095986 0.099492 0.086069 0.103623 0.089048 0.098888 0.117200 0.106258 0.088636 0.093519 0.093896 0.095216 0.102308 0.074826 0.098474 0.102480 0.112960 0.119256 0.102121 0.102519 0.092666 0.130207 0.130028 0.110147
qa: -0.2815 -0.4664 -0.4467 0.1292 -0.0064 -0.0790 -0.2638 -0.3005 -0.2761 0.3842 -0.0158 0.2342 -0.2326 -0.2572 -0.1391 -0.0490 -0.0846 0.2982 -0.2436 -0.0834 -0.1849 -0.2745 0.1021 0.0916 0.0960 0.0995 0.0861 0.1036 0.0890 0.0989 0.1172 0.1063 0.0886 0.0935 0.0939 0.0952 0.1023 0.0748 0.0985 0.1025 0.1130 0.1193 0.1021 0.1025 0.0927 0.1302 0.1300 0.1101
va: 2.1048 2.0385 2.0596 3.7556 3.7775 3.8290 3.8962 3.9215 3.8902 4.1947 3.7268 3.7530 3.9321 3.9480 3.9128 3.7328 3.4226 4.0690 3.9401 3.8477 3.8336 3.9083 1.0169 1.0297 1.0009 1.0004 1.0115 0.9985 1.0041 1.0012 1.0103 1.0350 1.0079 0.9949 0.9962 0.9974 0.9980 1.0137 1.0240 1.0255 0.9973 1.0023 1.0045 0.9994 1.0195 1.0028 1.0047 1.0151
dispcorr: -0.024046230 hartree
energy: -965.450401246618
dipole: -17.46377 15.73512 -1.72864 0.67276 -0.73226 -0.05950 -8.47880 7.53950 -0.93931
magnitude: 1.96826 au
magnitude: 5.00292 debye
