program: Gaussian 09
title: 000060765
version: EM64L-G09RevD.01
frameworkgroup: C1[X(C17H23ClO4)]
method: RPBEPBE
basis: SDD
operation: Freq
keyword: #p
keyword: freq=noraman
keyword: PBEPBE/SDD
title: #p freq=noraman PBEPBE/SDD
converged: YES YES NO NO
title: Mulliken charges:
elementType: Cl O O O O C C C C C C C C C C C C C C C C C H H H H H H H H H H H H H H H H H H H H H H H
charge: -0.070398 -0.277520 -0.266934 -0.232706 -0.264171 0.251697 -0.417680 -0.471022 -0.404387 0.214642 -0.374886 -0.378592 -0.407110 -0.319241 -0.222056 -0.673155 0.368706 -0.330294 -0.363750 -0.206456 -0.186673 -0.116375 0.216520 0.242970 0.215230 0.237512 0.197356 0.231938 0.199052 0.205908 0.192167 0.198333 0.219393 0.216767 0.209221 0.207427 0.229160 0.233632 0.227349 0.236954 0.214581 0.253842 0.256437 0.251303 0.255309
chargesum: 0.00000
title: Mulliken charges with hydrogens summed into heavy atoms:
elementType: Cl O O O O C C C C C C C C C C C C C C C C C
charge: -0.070398 -0.277520 -0.266934 -0.232706 -0.264171 0.251697 0.041810 -0.018280 0.024906 0.214642 0.030074 0.011908 0.029049 0.097407 0.240735 0.005730 0.368706 -0.076452 -0.107313 0.044847 0.068636 -0.116375
polarizability: 2.94741310e+02 -4.95342893e+00 1.84753970e+02 6.71722966e+00 1.05102481e+01 1.45672412e+02
1716.lowfreq: -5.6140 -0.0017 -0.0015 -0.0003 2.0324 4.5964 12.8272 14.8928 20.3783
frequency: 12.1271 14.1721 19.5040 29.4953 33.3832 59.8777 66.8284 74.2626 79.7374 102.7747 114.3916 117.3527 130.7203 136.0123 149.6989 156.3715 177.7761 227.0917 243.9538 264.0226 285.5699 292.2852 316.7334 321.5059 334.2859 358.2364 391.4348 414.8741 415.6110 480.1922 488.7141 498.3449 499.7672 556.1265 622.4831 639.0073 684.3323 696.7439 725.2114 739.7810 755.2132 788.5567 793.2237 795.1837 799.6484 805.1183 823.4647 826.7084 866.8834 886.1053 923.2802 927.6120 952.0255 966.7103 978.7452 989.9416 1008.7521 1019.1742 1028.3304 1055.9721 1061.1338 1069.1549 1070.8572 1079.8092 1103.5229 1108.8378 1113.6842 1130.8146 1135.2341 1138.1915 1152.4431 1173.8761 1212.8282 1222.4159 1225.0547 1249.9863 1255.2859 1273.9161 1281.5468 1289.4739 1289.8068 1295.9141 1300.5693 1325.9544 1345.8055 1355.0586 1359.8276 1366.9030 1366.9580 1385.8899 1403.6125 1405.3237 1455.4568 1463.3399 1463.6914 1465.5932 1468.2993 1469.6045 1473.5102 1475.6188 1484.1019 1486.1520 1490.9873 1583.7680 1604.7372 1620.2938 2945.0446 2955.7063 2961.5069 2969.3077 2994.2734 2995.5729 2997.4122 3001.7895 3002.8855 3012.5300 3016.9544 3038.6674 3063.0447 3067.3399 3069.2292 3071.7719 3093.8753 3109.7085 3156.0767 3158.7695 3174.8510 3179.4724 3185.2362
redmass: 5.7215 3.7603 5.5760 4.4951 5.0187 3.2447 5.0759 1.7860 4.6126 3.9040 4.8915 3.1643 1.9218 3.2965 3.1584 2.4907 5.4237 3.6734 1.5022 4.1080 4.9008 3.8776 7.0897 2.8838 4.7234 3.7186 3.8384 6.5821 3.0127 4.9712 3.9284 3.9721 2.9266 3.3724 7.0240 7.5243 8.3474 3.4155 1.1091 1.8984 1.8022 3.3624 5.8021 1.4583 1.2271 1.3852 1.6170 2.3838 3.1342 1.4718 1.4950 1.3547 1.3404 6.4592 1.3596 3.9788 4.5610 2.1914 3.3695 1.7631 1.5964 2.6905 2.5894 2.2700 3.2560 1.3188 2.2585 1.9876 1.4550 1.5289 1.3605 1.1743 1.4750 4.0408 1.2746 1.1354 1.3816 1.3997 1.1051 1.3485 1.2704 1.2275 1.3746 1.4590 1.8215 1.6613 1.6547 2.1393 2.9127 1.6436 1.2742 3.8596 1.1290 1.0795 1.0400 1.0944 1.2449 1.3549 1.0761 1.2767 1.1647 1.0656 1.1359 7.4372 6.5962 11.1474 1.0550 1.0586 1.0594 1.0622 1.0747 1.0800 1.0360 1.0625 1.1050 1.0582 1.0987 1.1029 1.1050 1.0658 1.0914 1.1065 1.0986 1.1027 1.0879 1.0884 1.0966 1.0977 1.1171
irintensity: 0.2467 0.3319 0.5606 1.1668 0.1544 0.7256 1.1513 0.2554 0.2844 1.6432 0.0301 2.0448 1.0339 1.5854 1.0614 3.7923 1.3437 2.7065 2.1704 9.8419 9.3994 2.5015 2.3154 1.4536 1.8029 11.9725 1.7117 3.9010 0.0317 0.5933 9.2443 3.6201 20.6290 5.3208 0.5197 53.1202 26.6978 0.6294 11.5558 7.5637 1.9152 3.1533 0.8161 18.5121 5.7024 1.3317 61.1817 19.0482 9.8938 4.6315 1.8795 0.2175 0.1835 84.4594 2.9057 33.0600 1.2731 17.6808 22.1847 81.9741 72.3075 0.3318 41.2164 3.4454 5.8159 11.9059 8.0127 160.8281 8.6714 100.5401 20.9908 54.6319 7.9996 285.8345 25.8232 0.1398 14.0896 8.2153 3.2238 13.5426 3.4806 4.8124 6.2085 1.9078 14.2234 4.9330 0.1524 6.8195 0.1798 35.7150 21.4431 1.0078 8.1697 1.8559 13.1608 3.6298 74.1504 95.0038 8.8957 53.1915 26.3170 13.6112 9.1485 14.9040 27.9624 188.1960 25.6058 6.8041 15.7529 58.0670 17.2204 16.5624 19.6081 26.6068 25.0772 16.5056 7.9090 20.3888 53.8499 2.2819 88.9103 7.4905 27.9939 40.5367 9.1655 1.8686 9.5855 1.1017 14.7976
temp: 298.150 k
press: 1.00000 atm
elementType: 17 8 8 8 8 6 6 6 6 6 6 6 6 6 6 6 6 6 6 6 6 6 1 1 1 1 1 1 1 1 1 1 1 1 1 1 1 1 1 1 1 1 1 1 1
symmnumber: 1
zpe: 961422.6 jmol-1
zpe.correction: 0.366187 hartree
zpe.thermalcorrener: 0.390364 hartree
zpe.thermalcorrenthalpy: 0.391308 hartree
zpe.thermalcorrgfe: 0.306479 hartree
zpe.sumelectzpe: -1420.824070 hartree
zpe.sumelectthermal: -1420.799892 hartree
zpe.sumelectthermalent: -1420.798948 hartree
zpe.sumelectthermalfe: -1420.883777 hartree
dipole: 3.4974 2.0095 2.1356
dipole: 4.5640
quadrupole: -169.5498 -133.7480 -139.3603
quadrupole: 24.2847 8.9578 1.6836
quadrupole: -21.9971 13.8047 8.1924 24.2847 8.9578 1.6836
hfenergy: -1421.1902561 hartree
pointgroup: C01 [X(C17H23Cl1O4)]
dipole: -1.3021867 -0.8252074 0.9206708 debye
polarizability: 294.7363355|3.2468282|182.5855574|-7.1883873|-14.0954555|147.8457997 unknown
InChI: InChI=1S/C17H23ClO4/c1-2-20-16(19)17(13-22-17)11-5-3-4-6-12-21-15-9-7-14(18)8-10-15/h7-10H,2-6,11-13H2,1H3
charge 0 multiplicity 1
45 atoms
Cl 9.678822 -0.507052 0.382505
O  -6.053311 1.410759 0.499971
O  -6.206016 -1.500852 0.401731
O  -4.65577 -1.301815 -1.325934
O  3.96131 1.225716 -0.453309
C  -4.844525 0.492328 0.332046
C  -5.363865 0.830648 1.701715
C  -3.588356 1.15429 -0.207546
C  -2.293467 0.424666 0.225701
C  -5.200323 -0.84272 -0.293037
C  -1.022171 1.145176 -0.274563
C  0.27821 0.407476 0.1146
C  1.547047 1.154239 -0.356801
C  2.827556 0.404937 0.01591
C  -6.69635 -2.779348 -0.205167
C  -7.782834 -3.316476 0.719141
C  5.257845 0.748435 -0.22067
C  5.561914 -0.477062 0.425065
C  6.305333 1.586709 -0.681856
C  6.912295 -0.857867 0.607333
C  7.649129 1.20844 -0.500307
C  7.935576 -0.013442 0.144665
H  -4.792316 1.554495 2.297759
H  -5.954269 0.091005 2.251927
H  -3.573326 2.200159 0.153773
H  -3.640816 1.184553 -1.311664
H  -2.260998 0.347544 1.332316
H  -2.308363 -0.608698 -0.17135
H  -0.995731 2.176957 0.133647
H  -1.069701 1.246236 -1.378184
H  0.309768 0.278552 1.21685
H  0.259943 -0.613313 -0.32059
H  1.519789 1.292834 -1.454476
H  1.581231 2.164318 0.094451
H  2.862796 -0.591397 -0.47272
H  2.901425 0.265235 1.115181
H  -5.836898 -3.467256 -0.301054
H  -7.073249 -2.553185 -1.218797
H  -7.380852 -3.521848 1.726078
H  -8.611437 -2.594422 0.813889
H  -8.188183 -4.259304 0.308878
H  4.772354 -1.140715 0.78793
H  6.048106 2.527181 -1.177772
H  7.155347 -1.801797 1.103883
H  8.459131 1.852684 -0.854048
