program: Orca
programVersion: 5.0.2
elementType: O O O C C C C C C C C C C C C C C C C C C C H H H H H H H H H H H H H H H H H H H H H H H H H H
charge: 0
multiplicity: 1
keywords: wb97x-d3
keywords: def2-TZVPP
keywords: def2/J RIJCOSX
keywords: DEFGRID2
keywords: scfconv7
keywords: smallprint printgap noloewdin
keywords: NOSOSCF
formula: C19H26O3
InChI: InChI=1/C19H26O3/c1-7-8-13-12(4)16(10-15(13)20)22-18(21)17-14(9-11(2)3)19(17,5)6/h7,9,14,16-17H,1,8,10H2,2-6H3
48 atoms
O  0.068515 -0.140903 0.737909
O  -0.323688 -0.063832 2.93151
O  4.138948 2.007805 0.315987
C  -2.739503 1.352821 0.847065
C  -2.698782 0.082991 0.041622
C  -2.164699 0.085081 1.452519
C  -1.821256 2.481366 0.446799
C  -4.054839 1.825966 1.413721
C  -3.912671 -0.701165 -0.27482
C  -0.73169 -0.042742 1.794213
C  -4.363707 -0.981488 -1.501591
C  1.472204 -0.278885 0.967955
C  -5.589208 -1.821125 -1.701091
C  -3.714516 -0.51131 -2.768123
C  2.173386 1.021261 1.341704
C  2.095864 -0.703362 -0.33492
C  3.119053 0.091212 -0.682519
C  3.274147 1.158066 0.314123
C  1.612888 -1.91681 -1.035363
C  4.04082 -0.063929 -1.842964
C  5.139742 -1.065921 -1.634054
C  5.333281 -1.819535 -0.558942
H  -1.940006 0.084479 -0.732552
H  -2.796145 -0.367872 2.21054
H  -2.337434 3.152079 -0.243349
H  -1.522389 3.073092 1.315029
H  -0.916801 2.14053 -0.055193
H  -4.687808 1.006373 1.752669
H  -3.891243 2.488687 2.265935
H  -4.614887 2.386755 0.662307
H  -4.471803 -1.088447 0.572504
H  1.639732 -1.0563 1.719778
H  -6.011289 -2.168311 -0.757879
H  -6.365269 -1.26498 -2.233894
H  -5.366869 -2.70017 -2.31263
H  -4.452013 -0.038455 -3.421563
H  -2.911927 0.206802 -2.609919
H  -3.30256 -1.353485 -3.331511
H  2.585615 1.012109 2.351054
H  1.503599 1.882345 1.272905
H  0.567141 -1.812453 -1.331781
H  1.66199 -2.781134 -0.368347
H  2.196196 -2.142605 -1.925778
H  3.479621 -0.346708 -2.73877
H  4.494291 0.901984 -2.084748
H  5.827416 -1.159434 -2.46939
H  6.159855 -2.517207 -0.514087
H  4.689494 -1.777747 0.311611
elementType: O C H
totalener: -965.42783336 hartree
nucrepener: 1814.24558521 hartree
electener: -2779.67341857 hartree
oneelecener: -4914.23535038 hartree
twoeener: 2134.56193181 hartree
cpcmener: -0.03158114 hartree
kineticenergy: 960.99783012 hartree
xcener: -95.139031866103 hartree
chargesum: -0.0000000
charge: -0.280905 -0.462838 -0.445426 0.124695 0.064316 -0.138546 -0.283090 -0.269293 -0.304166 0.398719 -0.026318 0.237479 -0.224633 -0.259392 -0.142158 -0.073511 -0.073866 0.308149 -0.252656 -0.079208 -0.185511 -0.272964 0.092207 0.095591 0.098474 0.102480 0.084634 0.088295 0.098427 0.095097 0.119009 0.107673 0.088129 0.093928 0.092654 0.093791 0.090256 0.099060 0.104498 0.104685 0.114814 0.113935 0.098288 0.103781 0.091411 0.130239 0.130180 0.109589
qa: -0.2809 -0.4628 -0.4454 0.1247 0.0643 -0.1385 -0.2831 -0.2693 -0.3042 0.3987 -0.0263 0.2375 -0.2246 -0.2594 -0.1422 -0.0735 -0.0739 0.3081 -0.2527 -0.0792 -0.1855 -0.2730 0.0922 0.0956 0.0985 0.1025 0.0846 0.0883 0.0984 0.0951 0.1190 0.1077 0.0881 0.0939 0.0927 0.0938 0.0903 0.0991 0.1045 0.1047 0.1148 0.1139 0.0983 0.1038 0.0914 0.1302 0.1302 0.1096
va: 2.1179 2.0423 2.0626 3.6976 3.7174 3.9097 3.9044 3.9031 3.8688 4.1734 3.7276 3.7426 3.9272 3.9460 3.8914 3.7671 3.4378 4.0581 3.9522 3.8330 3.8380 3.9058 1.0186 1.0324 1.0024 0.9996 1.0153 1.0043 1.0023 1.0028 1.0090 1.0199 1.0087 0.9965 0.9953 0.9986 1.0077 0.9962 1.0249 1.0208 1.0018 0.9967 1.0043 0.9989 1.0213 1.0028 1.0045 1.0156
dispcorr: -0.023565585 hartree
energy: -965.451398943851
dipole: -19.34370 17.61132 -1.73238 -4.18265 2.86550 -1.31715 -12.36602 10.65799 -1.70803
magnitude: 2.76648 au
magnitude: 7.03183 debye
