program: Orca
programVersion: 5.0.2
elementType: O O O C C C C C C C C C C C C C C C C C C C H H H H H H H H H H H H H H H H H H H H H H H H H H
charge: 0
multiplicity: 1
keywords: wb97x-d3
keywords: def2-TZVPP
keywords: def2/J RIJCOSX
keywords: DEFGRID2
keywords: scfconv7
keywords: smallprint printgap noloewdin
keywords: NOSOSCF
formula: C19H26O3
InChI: InChI=1/C19H26O3/c1-7-8-13-12(4)16(10-15(13)20)22-18(21)17-14(9-11(2)3)19(17,5)6/h7,9,14,16-17H,1,8,10H2,2-6H3
48 atoms
O  0.228628 0.494287 -0.039098
O  -0.855745 -0.05005 1.845457
O  4.25509 2.608126 -0.686492
C  -2.499589 -1.82265 -0.191176
C  -3.283257 -0.62846 0.232688
C  -1.86715 -0.440897 -0.287522
C  -2.038985 -2.80419 0.858174
C  -2.801529 -2.480039 -1.516384
C  -4.436484 -0.097413 -0.533609
C  -0.811765 0.002328 0.638619
C  -4.992229 1.101334 -0.335237
C  1.361248 1.008345 0.668023
C  -6.185438 1.545814 -1.124409
C  -4.488494 2.088612 0.672618
C  1.94267 2.200202 -0.07845
C  2.47117 -0.013065 0.696765
C  3.620877 0.486829 0.21681
C  3.405529 1.863683 -0.245306
C  2.237842 -1.374293 1.235086
C  4.94166 -0.206976 0.098214
C  4.977202 -1.104681 -1.103292
C  5.19572 -2.4130 -1.060117
H  -3.356866 -0.507077 1.309881
H  -1.769502 -0.0576 -1.296948
H  -1.095155 -3.272347 0.571402
H  -1.907472 -2.355146 1.840048
H  -2.778581 -3.600481 0.963007
H  -3.053777 -1.763573 -2.297849
H  -1.937197 -3.049283 -1.863573
H  -3.636595 -3.177319 -1.420678
H  -4.867334 -0.742764 -1.293489
H  1.07279 1.274684 1.687414
H  -6.519675 0.784931 -1.829791
H  -7.025275 1.786193 -0.466833
H  -5.96648 2.456422 -1.688724
H  -3.554724 1.788728 1.144265
H  -4.325367 3.063314 0.207866
H  -5.225105 2.247289 1.463687
H  1.815356 3.144687 0.451358
H  1.486752 2.3158 -1.06465
H  1.590556 -1.947439 0.566101
H  1.734194 -1.331789 2.202159
H  3.16316 -1.934426 1.353853
H  5.730239 0.54643 0.013756
H  5.152416 -0.784798 1.000676
H  4.801887 -0.6243 -2.061679
H  5.210432 -3.012669 -1.961375
H  5.378193 -2.933232 -0.126425
elementType: O C H
totalener: -965.42847709 hartree
nucrepener: 1793.14355300 hartree
electener: -2758.57203009 hartree
oneelecener: -4872.36274284 hartree
twoeener: 2113.79071275 hartree
cpcmener: -0.02733559 hartree
kineticenergy: 960.99711170 hartree
xcener: -95.137525954669 hartree
chargesum: 0.0000000
charge: -0.289113 -0.472086 -0.449836 0.156197 -0.058597 -0.065042 -0.277185 -0.295607 -0.269717 0.369173 -0.013953 0.245576 -0.228999 -0.250727 -0.137921 -0.040330 -0.066727 0.290367 -0.258684 -0.095606 -0.182871 -0.281676 0.102393 0.091145 0.095379 0.094948 0.098271 0.089774 0.098161 0.102349 0.123656 0.103566 0.088204 0.094237 0.094473 0.080537 0.094641 0.100981 0.099333 0.099956 0.116868 0.117752 0.101733 0.095935 0.103624 0.143305 0.129196 0.112948
qa: -0.2891 -0.4721 -0.4498 0.1562 -0.0586 -0.0650 -0.2772 -0.2956 -0.2697 0.3692 -0.0140 0.2456 -0.2290 -0.2507 -0.1379 -0.0403 -0.0667 0.2904 -0.2587 -0.0956 -0.1829 -0.2817 0.1024 0.0911 0.0954 0.0949 0.0983 0.0898 0.0982 0.1023 0.1237 0.1036 0.0882 0.0942 0.0945 0.0805 0.0946 0.1010 0.0993 0.1000 0.1169 0.1178 0.1017 0.0959 0.1036 0.1433 0.1292 0.1129
va: 2.1255 2.0261 2.0538 3.7251 3.8473 3.8060 3.8818 3.9129 3.8798 4.1757 3.7087 3.7650 3.9299 3.9438 3.9037 3.7497 3.4391 4.0703 3.9257 3.8560 3.7998 3.9397 1.0229 1.0328 1.0013 1.0167 1.0021 1.0017 1.0026 0.9982 1.0036 1.0293 1.0074 0.9955 0.9964 1.0161 0.9987 0.9978 1.0239 1.0292 0.9977 1.0100 1.0070 1.0252 1.0046 1.0026 1.0042 1.0095
dispcorr: -0.022812889 hartree
energy: -965.451289976893
dipole: -18.51570 17.10524 -1.41046 -10.91488 9.70873 -1.20616 -2.53134 2.48080 -0.05053
magnitude: 1.85655 au
magnitude: 4.71897 debye
