program: Orca
programVersion: 5.0.2
elementType: O O O C C C C C C C C C C C C C C C C C C C H H H H H H H H H H H H H H H H H H H H H H H H H H
charge: 0
multiplicity: 1
keywords: wb97x-d3
keywords: def2-TZVPP
keywords: def2/J RIJCOSX
keywords: DEFGRID2
keywords: scfconv7
keywords: smallprint printgap noloewdin
keywords: NOSOSCF
formula: C19H26O3
InChI: InChI=1/C19H26O3/c1-7-8-13-12(4)16(10-15(13)20)22-18(21)17-14(9-11(2)3)19(17,5)6/h7,9,14,16-17H,1,8,10H2,2-6H3
48 atoms
O  0.344759 0.535712 -0.316611
O  -0.620513 -0.21769 1.560778
O  4.596057 2.341465 -0.781274
C  -2.659353 -1.380362 -0.547085
C  -3.256556 -0.187133 0.137645
C  -1.874895 -0.080269 -0.474737
C  -2.265232 -2.565119 0.300941
C  -3.148644 -1.77181 -1.919804
C  -4.368568 0.595787 -0.439511
C  -0.686548 0.057357 0.38669
C  -5.504517 0.886868 0.20131
C  1.600683 0.759601 0.326554
C  -6.57695 1.706652 -0.4485
C  -5.787959 0.43449 1.60972
C  2.257873 2.020646 -0.213649
C  2.572266 -0.348798 0.006316
C  3.746089 0.132483 -0.432672
C  3.67778 1.596817 -0.511269
C  2.214377 -1.767157 0.244142
C  4.981801 -0.634656 -0.760776
C  5.784628 -1.08209 0.42747
C  5.471168 -0.921186 1.706984
H  -3.256833 -0.259189 1.220738
H  -1.807407 0.457636 -1.414272
H  -2.023135 -2.297534 1.327007
H  -3.093524 -3.275434 0.338983
H  -1.406197 -3.089138 -0.123942
H  -2.404992 -2.389439 -2.427517
H  -4.068372 -2.355981 -1.847502
H  -3.351059 -0.913079 -2.558859
H  -4.237572 0.959223 -1.454584
H  1.458837 0.819836 1.408413
H  -6.302438 2.026957 -1.453754
H  -7.512879 1.145338 -0.516512
H  -6.798677 2.601006 0.140693
H  -5.572068 -0.624389 1.758683
H  -5.193613 0.989052 2.340563
H  -6.834998 0.59103 1.870533
H  2.223641 2.863472 0.476319
H  1.7861 2.33759 -1.147576
H  1.923452 -1.920203 1.285633
H  3.037071 -2.442697 0.018788
H  1.358775 -2.062584 -0.368402
H  4.729325 -1.517847 -1.356167
H  5.626198 -0.031987 -1.407329
H  6.708442 -1.594576 0.175466
H  6.12346 -1.292814 2.487201
H  4.567701 -0.418729 2.031842
elementType: O C H
totalener: -965.42839851 hartree
nucrepener: 1780.04576258 hartree
electener: -2745.47416109 hartree
oneelecener: -4846.16349226 hartree
twoeener: 2100.68933116 hartree
cpcmener: -0.02925505 hartree
kineticenergy: 960.97908214 hartree
xcener: -95.136439258373 hartree
chargesum: -0.0000000
charge: -0.290222 -0.466874 -0.448142 0.122331 0.040656 -0.115200 -0.283897 -0.266351 -0.304461 0.380154 -0.009352 0.256797 -0.220236 -0.284703 -0.134409 -0.059595 -0.074841 0.298050 -0.246221 -0.081099 -0.185063 -0.275838 0.095229 0.088130 0.094430 0.098582 0.093760 0.097138 0.097073 0.087645 0.117664 0.102783 0.084235 0.094454 0.098197 0.101755 0.105107 0.095123 0.095536 0.099929 0.116209 0.103060 0.117038 0.102974 0.090447 0.130611 0.130052 0.111354
qa: -0.2902 -0.4669 -0.4481 0.1223 0.0407 -0.1152 -0.2839 -0.2664 -0.3045 0.3802 -0.0094 0.2568 -0.2202 -0.2847 -0.1344 -0.0596 -0.0748 0.2981 -0.2462 -0.0811 -0.1851 -0.2758 0.0952 0.0881 0.0944 0.0986 0.0938 0.0971 0.0971 0.0876 0.1177 0.1028 0.0842 0.0945 0.0982 0.1018 0.1051 0.0951 0.0955 0.0999 0.1162 0.1031 0.1170 0.1030 0.0904 0.1306 0.1301 0.1114
va: 2.1236 2.0368 2.0569 3.6771 3.7742 3.8843 3.9047 3.9086 3.8941 4.1895 3.6962 3.7654 3.9232 3.9421 3.9126 3.7428 3.4227 4.0609 3.9256 3.8466 3.8346 3.9086 1.0265 1.0379 1.0180 1.0015 1.0018 1.0022 1.0020 1.0054 1.0098 1.0340 1.0104 0.9938 0.9927 0.9963 0.9957 1.0041 1.0258 1.0275 1.0030 1.0053 1.0015 0.9988 1.0218 1.0025 1.0048 1.0138
dispcorr: -0.022790505 hartree
energy: -965.451189019800
dipole: -22.64761 20.95625 -1.69136 -10.94496 9.50341 -1.44155 0.48605 -0.99423 -0.50819
magnitude: 2.27970 au
magnitude: 5.79454 debye
