program: Orca
programVersion: 5.0.2
elementType: O O O C C C C C C C C C C C C C C C C C C C H H H H H H H H H H H H H H H H H H H H H H H H H H
charge: 0
multiplicity: 1
keywords: wb97x-d3
keywords: def2-TZVPP
keywords: def2/J RIJCOSX
keywords: DEFGRID2
keywords: scfconv7
keywords: smallprint printgap noloewdin
keywords: NOSOSCF
formula: C19H26O3
InChI: InChI=1/C19H26O3/c1-7-8-13-12(4)16(10-15(13)20)22-18(21)17-14(9-11(2)3)19(17,5)6/h7,9,14,16-17H,1,8,10H2,2-6H3
48 atoms
O  0.353147 0.574197 -0.266602
O  -0.612715 -0.250112 1.580004
O  4.622046 2.236521 -0.848753
C  -2.643085 -1.324725 -0.591162
C  -3.245248 -0.18003 0.167737
C  -1.870285 -0.022957 -0.444797
C  -2.229694 -2.556422 0.176557
C  -3.145068 -1.635801 -1.979976
C  -4.364353 0.626135 -0.366403
C  -0.678662 0.074266 0.418344
C  -5.550873 0.81615 0.21932
C  1.615341 0.75876 0.37963
C  -6.599734 1.671811 -0.426282
C  -5.957545 0.219596 1.532148
C  2.305316 2.000048 -0.166927
C  2.551694 -0.380103 0.056834
C  3.717998 0.06119 -0.439644
C  3.692222 1.52577 -0.531173
C  2.177053 -1.783214 0.352735
C  4.921755 -0.740411 -0.798503
C  5.803308 -1.096778 0.363637
C  5.575408 -0.830316 1.643652
H  -3.236002 -0.316027 1.244214
H  -1.812659 0.569321 -1.351871
H  -1.961668 -2.351014 1.210688
H  -3.056579 -3.269433 0.192288
H  -1.381606 -3.053286 -0.300273
H  -2.399842 -2.207307 -2.536927
H  -4.05477 -2.238135 -1.932115
H  -3.371624 -0.741262 -2.559036
H  -4.192607 1.105696 -1.326097
H  1.4734 0.825978 1.460974
H  -6.900244 2.490332 0.233628
H  -6.258459 2.10738 -1.365464
H  -7.505811 1.095304 -0.631881
H  -6.888298 -0.342913 1.42202
H  -5.21748 -0.454908 1.958296
H  -6.158658 1.002587 2.268227
H  2.340937 2.825124 0.544735
H  1.807844 2.366038 -1.068698
H  2.968315 -2.483607 0.092634
H  1.276414 -2.076852 -0.191897
H  1.954894 -1.902174 1.415549
H  4.625065 -1.664764 -1.303761
H  5.520511 -0.194355 -1.533518
H  6.708547 -1.632353 0.093298
H  6.2785 -1.139961 2.40642
H  4.694425 -0.30029 1.98591
elementType: O C H
totalener: -965.42971475 hartree
nucrepener: 1780.08952627 hartree
electener: -2745.51924102 hartree
oneelecener: -4846.26510294 hartree
twoeener: 2100.74586192 hartree
cpcmener: -0.02977227 hartree
kineticenergy: 960.98503071 hartree
xcener: -95.137780631308 hartree
chargesum: -0.0000000
charge: -0.288078 -0.466005 -0.447616 0.131132 0.031628 -0.114360 -0.290382 -0.262819 -0.282283 0.378494 -0.036839 0.254732 -0.222339 -0.253390 -0.134070 -0.053531 -0.077429 0.296986 -0.248012 -0.085222 -0.185652 -0.274327 0.092994 0.088523 0.095591 0.100248 0.093178 0.097037 0.096731 0.087729 0.117862 0.104212 0.093131 0.088377 0.093330 0.093703 0.089889 0.097400 0.096281 0.099913 0.102655 0.116609 0.117187 0.103292 0.092376 0.130683 0.129820 0.110634
qa: -0.2881 -0.4660 -0.4476 0.1311 0.0316 -0.1144 -0.2904 -0.2628 -0.2823 0.3785 -0.0368 0.2547 -0.2223 -0.2534 -0.1341 -0.0535 -0.0774 0.2970 -0.2480 -0.0852 -0.1857 -0.2743 0.0930 0.0885 0.0956 0.1002 0.0932 0.0970 0.0967 0.0877 0.1179 0.1042 0.0931 0.0884 0.0933 0.0937 0.0899 0.0974 0.0963 0.0999 0.1027 0.1166 0.1172 0.1033 0.0924 0.1307 0.1298 0.1106
va: 2.1259 2.0371 2.0574 3.6716 3.7786 3.8806 3.9042 3.9031 3.8762 4.1901 3.7397 3.7663 3.9241 3.9442 3.9100 3.7459 3.4309 4.0629 3.9306 3.8458 3.8350 3.9084 1.0312 1.0380 1.0170 1.0019 1.0014 1.0024 1.0026 1.0052 1.0098 1.0319 0.9957 1.0089 0.9966 0.9977 1.0091 0.9966 1.0254 1.0282 1.0056 0.9994 1.0019 0.9991 1.0198 1.0026 1.0048 1.0146
dispcorr: -0.022816572 hartree
energy: -965.452531321279
dipole: -22.96818 21.24483 -1.72335 -10.82214 9.44278 -1.37936 0.19377 -0.63661 -0.44284
magnitude: 2.25137 au
magnitude: 5.72253 debye
