program: Orca
programVersion: 5.0.2
elementType: O O O C C C C C C C C C C C C C C C C C C C H H H H H H H H H H H H H H H H H H H H H H H H H H
charge: 0
multiplicity: 1
keywords: wb97x-d3
keywords: def2-TZVPP
keywords: def2/J RIJCOSX
keywords: DEFGRID2
keywords: scfconv7
keywords: smallprint printgap noloewdin
keywords: NOSOSCF
formula: C19H26O3
InChI: InChI=1/C19H26O3/c1-7-8-13-12(4)16(10-15(13)20)22-18(21)17-14(9-11(2)3)19(17,5)6/h7,9,14,16-17H,1,8,10H2,2-6H3
48 atoms
O  0.287121 0.468424 -0.235195
O  -0.773275 -0.140858 1.642708
O  4.592259 1.949959 -0.882433
C  -2.72968 -1.382648 -0.515147
C  -3.343739 -0.183824 0.144551
C  -1.949137 -0.079769 -0.441111
C  -2.341816 -2.557898 0.348802
C  -3.189954 -1.797064 -1.891767
C  -4.440486 0.592151 -0.466987
C  -0.785309 0.068595 0.452904
C  -5.540225 1.042772 0.146716
C  1.528569 0.683002 0.444679
C  -6.566221 1.835099 -0.607991
C  -5.873211 0.820883 1.590291
C  2.269994 1.854366 -0.182746
C  2.441622 -0.505792 0.260782
C  3.628018 -0.144317 -0.253305
C  3.641598 1.304665 -0.495366
C  2.003555 -1.858912 0.679607
C  4.837393 -0.983869 -0.514976
C  5.820594 -0.858095 0.612756
C  7.009467 -0.27679 0.518237
H  -3.360005 -0.243969 1.22738
H  -1.858227 0.444346 -1.386448
H  -2.09596 -2.281023 1.371815
H  -3.172198 -3.265487 0.395536
H  -1.485764 -3.089551 -0.072926
H  -2.43614 -2.423457 -2.372919
H  -4.110518 -2.381128 -1.827082
H  -3.379904 -0.951752 -2.55192
H  -4.329081 0.821806 -1.522939
H  1.344685 0.849714 1.508512
H  -7.550878 1.363118 -0.550862
H  -6.680787 2.835155 -0.180407
H  -6.309401 1.949286 -1.66128
H  -6.785589 0.226617 1.683601
H  -5.092925 0.312602 2.152622
H  -6.075625 1.771955 2.088209
H  2.334868 2.722965 0.473224
H  1.793555 2.180457 -1.110376
H  1.704653 -1.855087 1.7299
H  2.784678 -2.605649 0.552128
H  1.132599 -2.186149 0.106191
H  4.546657 -2.029941 -0.635909
H  5.303296 -0.673597 -1.452994
H  5.49689 -1.26402 1.567148
H  7.67255 -0.208285 1.371491
H  7.367756 0.14751 -0.412578
elementType: O C H
totalener: -965.42991165 hartree
nucrepener: 1768.52391121 hartree
electener: -2733.95382285 hartree
oneelecener: -4823.23120700 hartree
twoeener: 2089.27738415 hartree
cpcmener: -0.03025314 hartree
kineticenergy: 960.98238689 hartree
xcener: -95.135601723982 hartree
chargesum: 0.0000000
charge: -0.287710 -0.465498 -0.447686 0.110470 0.033575 -0.087771 -0.283731 -0.269469 -0.275993 0.374913 -0.051456 0.236482 -0.216912 -0.251063 -0.134207 -0.026293 -0.070296 0.280888 -0.253188 -0.110073 -0.175204 -0.275974 0.093587 0.089194 0.094811 0.100817 0.092979 0.096680 0.097687 0.088149 0.116072 0.105699 0.091465 0.093713 0.087587 0.097693 0.089419 0.093777 0.098417 0.100590 0.115170 0.104076 0.111572 0.108398 0.099354 0.140152 0.127907 0.111235
qa: -0.2877 -0.4655 -0.4477 0.1105 0.0336 -0.0878 -0.2837 -0.2695 -0.2760 0.3749 -0.0515 0.2365 -0.2169 -0.2511 -0.1342 -0.0263 -0.0703 0.2809 -0.2532 -0.1101 -0.1752 -0.2760 0.0936 0.0892 0.0948 0.1008 0.0930 0.0967 0.0977 0.0881 0.1161 0.1057 0.0915 0.0937 0.0876 0.0977 0.0894 0.0938 0.0984 0.1006 0.1152 0.1041 0.1116 0.1084 0.0994 0.1402 0.1279 0.1112
va: 2.1256 2.0373 2.0531 3.6830 3.7868 3.8293 3.9038 3.9067 3.8718 4.2009 3.7695 3.7847 3.9213 3.9402 3.9167 3.7346 3.4423 4.0798 3.9353 3.8691 3.7815 3.9576 1.0310 1.0352 1.0169 1.0018 1.0013 1.0019 1.0015 1.0065 1.0116 1.0290 0.9965 0.9964 1.0090 0.9967 1.0111 0.9973 1.0248 1.0287 1.0031 1.0069 0.9983 1.0051 1.0182 1.0006 1.0033 1.0136
dispcorr: -0.022188780 hartree
energy: -965.452100425422
dipole: -21.68507 19.89051 -1.79456 -8.97940 7.67474 -1.30466 -0.08697 -0.09360 -0.18057
magnitude: 2.22602 au
magnitude: 5.65810 debye
