program: Orca
programVersion: 5.0.2
elementType: O O O C C C C C C C C C C C C C C C C C C C H H H H H H H H H H H H H H H H H H H H H H H H H H
charge: 0
multiplicity: 1
keywords: wb97x-d3
keywords: def2-TZVPP
keywords: def2/J RIJCOSX
keywords: DEFGRID2
keywords: scfconv7
keywords: smallprint printgap noloewdin
keywords: NOSOSCF
formula: C19H26O3
InChI: InChI=1/C19H26O3/c1-7-8-13-12(4)16(10-15(13)20)22-18(21)17-14(9-11(2)3)19(17,5)6/h7,9,14,16-17H,1,8,10H2,2-6H3
48 atoms
O  0.270664 0.404139 -0.311011
O  -0.713002 -0.253822 1.592122
O  4.527271 2.209868 -0.775887
C  -2.798078 -1.482751 -0.410481
C  -3.340695 -0.202281 0.148042
C  -1.947979 -0.223642 -0.458205
C  -2.474576 -2.599561 0.55135
C  -3.293875 -1.984234 -1.745401
C  -4.406355 0.575044 -0.512833
C  -0.766928 -0.041134 0.404217
C  -5.465797 1.101947 0.108178
C  1.519312 0.657585 0.336266
C  -6.497784 1.88013 -0.649103
C  -5.704247 0.958488 1.58893
C  2.177747 1.90269 -0.240159
C  2.497833 -0.458715 0.066471
C  3.672616 0.012972 -0.380248
C  3.602748 1.47419 -0.50364
C  2.142987 -1.867259 0.362197
C  4.936885 -0.743061 -0.639461
C  5.711603 -0.907091 0.635633
C  6.874533 -0.326465 0.900884
H  -3.348768 -0.167151 1.232945
H  -1.85272 0.217123 -1.444468
H  -2.213872 -2.24911 1.547122
H  -3.345453 -3.25016 0.654546
H  -1.651099 -3.214714 0.182247
H  -3.45179 -1.186336 -2.469971
H  -2.575364 -2.681908 -2.180181
H  -4.239681 -2.517136 -1.626569
H  -4.308828 0.726759 -1.583693
H  1.365427 0.756598 1.413527
H  -7.486532 1.424225 -0.547575
H  -6.588046 2.89724 -0.25757
H  -6.266763 1.948614 -1.712311
H  -5.775805 -0.087003 1.894825
H  -4.904021 1.409307 2.179636
H  -6.633387 1.443949 1.887452
H  2.131493 2.768282 0.420499
H  1.716203 2.185919 -1.189945
H  1.901313 -1.986151 1.420899
H  2.950678 -2.55544 0.120362
H  1.259138 -2.178331 -0.199277
H  4.70285 -1.725392 -1.057254
H  5.538702 -0.216274 -1.382304
H  5.24723 -1.537831 1.389005
H  7.373098 -0.481248 1.84967
H  7.374985 0.315436 0.185104
elementType: O C H
totalener: -965.42824780 hartree
nucrepener: 1767.39770943 hartree
electener: -2732.82595723 hartree
oneelecener: -4820.91403512 hartree
twoeener: 2088.08807789 hartree
cpcmener: -0.02950928 hartree
kineticenergy: 960.98564734 hartree
xcener: -95.135444750257 hartree
chargesum: 0.0000000
charge: -0.292403 -0.468960 -0.448253 0.107395 0.043175 -0.100818 -0.278484 -0.269335 -0.299106 0.382744 -0.010576 0.242815 -0.222206 -0.284471 -0.132479 -0.029639 -0.067637 0.282157 -0.251754 -0.102444 -0.181751 -0.276461 0.093416 0.087458 0.094388 0.097558 0.093091 0.087845 0.096842 0.097324 0.115233 0.103609 0.096585 0.097066 0.084217 0.104972 0.102507 0.095009 0.095639 0.101213 0.116462 0.102612 0.112101 0.111642 0.090557 0.140151 0.128401 0.112593
qa: -0.2924 -0.4690 -0.4483 0.1074 0.0432 -0.1008 -0.2785 -0.2693 -0.2991 0.3827 -0.0106 0.2428 -0.2222 -0.2845 -0.1325 -0.0296 -0.0676 0.2822 -0.2518 -0.1024 -0.1818 -0.2765 0.0934 0.0875 0.0944 0.0976 0.0931 0.0878 0.0968 0.0973 0.1152 0.1036 0.0966 0.0971 0.0842 0.1050 0.1025 0.0950 0.0956 0.1012 0.1165 0.1026 0.1121 0.1116 0.0906 0.1402 0.1284 0.1126
va: 2.1247 2.0338 2.0512 3.6898 3.7816 3.8706 3.9033 3.9105 3.8988 4.1843 3.6951 3.7808 3.9203 3.9402 3.9150 3.7441 3.4484 4.0773 3.9373 3.8639 3.7952 3.9604 1.0271 1.0370 1.0191 1.0010 1.0017 1.0063 1.0020 1.0014 1.0108 1.0312 0.9930 0.9928 1.0103 0.9952 0.9970 1.0048 1.0263 1.0269 1.0010 1.0046 1.0023 1.0028 1.0252 0.9990 1.0026 1.0131
dispcorr: -0.022087616 hartree
energy: -965.450335414865
dipole: -21.53946 19.74232 -1.79714 -9.32661 7.89762 -1.42899 0.40140 -0.74305 -0.34165
magnitude: 2.32130 au
magnitude: 5.90029 debye
